program: Orca
programVersion: 6.0.0
elementType: O O C O O C C C F F F F F F O H H Ni O H H O H H O H H
charge: 0
multiplicity: 3
keywords: TPSS D3BJ TightOpt Freq def2-TZVPP def2/J RIJCOSX TightSCF defgrid3 CPCM(Acetonitrile)
frequency: 0.00 0.00 0.00 0.00 0.00 0.00 10.47 14.33 17.18 37.25 39.96 46.82 47.96 96.12 97.62 99.46 113.65 121.15 125.39 135.10 136.44 151.34 161.67 177.14 213.01 222.81 235.86 260.70 264.83 268.43 291.83 312.08 325.67 330.66 354.08 424.22 426.06 437.98 443.66 458.68 465.19 493.80 494.51 515.06 524.02 583.05 584.63 591.27 598.17 623.66 632.22 692.73 694.43 766.92 768.04 798.91 803.17 950.63 966.81 1048.70 1048.86 1094.15 1094.71 1149.90 1153.33 1384.84 1385.25 1583.87 1585.99 1602.60 1605.12 1633.31 1640.15 3018.63 3045.80 3668.47 3672.45 3728.10 3730.57 3748.45 3752.96
frequency: 10.47 14.33 17.18 37.25 39.96 46.82 47.96 96.12 97.62 99.46 113.65 121.15 125.39 135.10 136.44 151.34 161.67 177.14 213.01 222.81 235.86 260.70 264.83 268.43 291.83 312.08 325.67 330.66 354.08 424.22 426.06 437.98 443.66 458.68 465.19 493.80 494.51 515.06 524.02 583.05 584.63 591.27 598.17 623.66 632.22 692.73 694.43 766.92 768.04 798.91 803.17 950.63 966.81 1048.70 1048.86 1094.15 1094.71 1149.90 1153.33 1384.84 1385.25 1583.87 1585.99 1602.60 1605.12 1633.31 1640.15 3018.63 3045.80 3668.47 3672.45 3728.10 3730.57 3748.45 3752.96
formula: C4H8F6NiO8
InChI: InChI=1/2C2F3O2.Ni.4H2O/c2*3-2(4,5)1(6)7;;;;;/h;;;4*1H2/q2*-1;+2;;;;/rC4H8F6NiO8/c5-3(6,7)1(12)18-11(14,15,16,17)19-2(13)4(8,9)10/h14-17H2
27 atoms
O  0.945329 0.919634 8.136013
O  3.837941 6.708005 6.423035
C  2.704142 6.461881 5.96807
O  2.89098 2.094921 8.277863
O  1.980861 5.430156 6.100551
C  2.133958 1.098053 8.467256
C  2.849368 -0.059263 9.232093
C  2.020521 7.563828 5.099773
F  3.914648 -0.521733 8.523522
F  2.037753 -1.112308 9.469474
F  3.321886 0.365871 10.433691
F  0.869638 7.994178 5.683437
F  2.805557 8.646763 4.913703
F  1.692072 7.086083 3.870471
O  0.42131 3.246353 7.047283
H  0.163468 3.207757 6.112451
H  0.451437 2.29656 7.37896
Ni 2.41596 3.787191 7.238121
O  2.913712 2.773865 5.468411
H  3.68874 2.207725 5.62243
H  3.19538 3.410342 4.789668
O  1.813874 4.745703 9.010333
H  2.172784 5.646605 9.077824
H  0.850258 4.863458 8.948202
O  4.388076 4.373601 7.495605
H  4.641355 4.388095 8.432509
H  4.349085 5.329812 7.188787
totalener: -2867.41095168160427 hartree
nucrepener: 2242.07461153898566 hartree
electener: -5109.44226349366090 hartree
oneelecener: -8445.01331086592472 hartree
twoeener: 3335.57104737226382 hartree
cpcmener: -0.04329972692901 hartree
kineticenergy: 2859.95680768193779 hartree
exchangeener: -213.193989960038 hartree
correlationener: -6.500460627206 hartree
xcener: -219.694450587243 hartree
s2: 2.002202
dispersion: -0.033341193 hartree
s2: 2.002221
dispersion: -0.033512121 hartree
s2: 2.002253
dispersion: -0.033894187 hartree
s2: 2.002261
dispersion: -0.034023276 hartree
s2: 2.002260
dispersion: -0.033293195 hartree
s2: 2.002249
dispersion: -0.033191913 hartree
s2: 2.002239
dispersion: -0.033242708 hartree
s2: 2.002232
dispersion: -0.033157817 hartree
dispersion: -0.033110961 hartree
s2: 2.002216
dispersion: -0.033146250 hartree
s2: 2.002210
dispersion: -0.033308657 hartree
s2: 2.002205
dispersion: -0.033321490 hartree
dispersion: -0.033312272 hartree
s2: 2.002203
dispersion: -0.033259653 hartree
s2: 2.002206
dispersion: -0.033190208 hartree
s2: 2.002208
dispersion: -0.033150979 hartree
s2: 2.002209
dispersion: -0.033134944 hartree
dispersion: -0.033133025 hartree
dispersion: -0.033150239 hartree
dispersion: -0.033176034 hartree
dispersion: -0.033198685 hartree
dispersion: -0.033205718 hartree
dispersion: -0.033198422 hartree
s2: 2.002207
dispersion: -0.033194134 hartree
dispersion: -0.033186439 hartree
dispersion: -0.033178084 hartree
dispersion: -0.033172014 hartree
dispersion: -0.033174284 hartree
dispersion: -0.033178947 hartree
dispersion: -0.033179308 hartree
dispersion: -0.033185629 hartree
dispersion: -0.033180815 hartree
dispersion: -0.033179346 hartree
dispersion: -0.033177676 hartree
dispersion: -0.033177876 hartree
dispersion: -0.033179690 hartree
dispersion: -0.033180119 hartree
dispersion: -0.033180391 hartree
dispersion: -0.033181083 hartree
dispersion: -0.033181925 hartree
elementType: O C F H Ni
energy: -8135.9515 -963.6045 -839.4244 -839.3987 -839.3858 -665.2152 -665.2012 -665.1988 -665.1969 -665.1834 -665.1831 -515.0752 -515.0672 -514.5295 -514.5170 -514.1146 -514.0841 -513.8264 -513.8040 -278.4493 -278.4320 -275.3717 -275.3450 -107.3283 -69.4591 -69.4058 -69.3873 -33.5556 -33.5396 -31.3471 -31.3318 -31.3043 -31.2886 -27.6331 -27.5938 -26.8028 -26.7696 -26.2024 -26.1831 -25.4249 -25.3818 -18.4793 -18.4603 -15.7379 -15.7190 -14.7238 -14.7080 -14.6989 -14.6806 -14.0561 -14.0496 -13.7484 -13.6535 -13.0017 -12.7402 -11.9615 -11.6423 -11.4522 -11.4361 -11.4028 -11.3181 -11.2912 -11.1019 -11.0046 -10.8741 -10.7690 -10.5033 -10.4326 -10.3718 -10.3274 -10.3182 -10.1227 -10.0786 -9.8107 -9.7964 -9.4153 -8.8996 -8.6521 -8.3801 -8.3691 -7.6951 -7.4496 -7.3722 -7.1887 -6.8597 -6.7400 -6.5407 -6.5130 -6.0614 -5.6541 -1.2885 -1.2172 -0.2624 0.5757 1.0323 1.7206 1.9233 2.2931 2.4539 2.6040 2.6260 electronvolt
energy: -8135.9378 -962.6693 -838.6540 -838.6421 -838.6291 -665.2132 -665.1992 -665.1989 -665.1969 -665.1834 -665.1832 -515.0265 -515.0189 -514.4783 -514.4644 -514.0622 -514.0317 -513.8272 -513.8048 -278.4442 -278.4268 -275.3731 -275.3466 -105.1208 -67.2580 -67.2203 -67.2025 -33.5538 -33.5378 -31.3448 -31.3295 -31.3042 -31.2885 -27.5972 -27.5595 -26.7268 -26.6949 -26.1200 -26.0961 -25.3797 -25.3369 -18.4628 -18.4443 -15.7185 -15.7015 -14.7218 -14.7060 -14.6927 -14.6753 -14.0254 -14.0197 -13.7109 -13.6270 -12.9232 -12.7053 -11.9017 -11.6012 -11.4413 -11.4298 -11.3280 -11.2927 -11.0874 -11.0382 -10.9889 -10.7300 -10.5701 -10.4807 -10.3732 -10.3442 -10.2767 -10.2209 -10.1077 -10.0694 -9.8098 -9.7956 -8.8493 -8.7396 -8.5098 -8.2368 -7.6837 -7.5568 -7.4120 -7.2471 -7.0452 -6.8483 -5.9550 -5.8518 -5.8200 -3.1134 -2.9316 -1.2803 -1.1999 -0.2184 0.5973 1.0532 1.7505 1.9416 2.3198 2.4682 electronvolt
chargesum: -0.0000000
charge: -0.431204 -0.433717 0.282086 -0.441885 -0.440580 0.269732 0.415732 0.413544 -0.160721 -0.153332 -0.159908 -0.160121 -0.153026 -0.159325 -0.441707 0.263094 0.249920 0.825845 -0.378235 0.273484 0.269572 -0.375584 0.273250 0.266237 -0.425391 0.264383 0.247856
charge: 0.087219 0.085911 -0.550938 0.139396 0.136818 -0.549916 -0.624241 -0.624916 0.176807 0.191189 0.178273 0.177339 0.191575 0.178747 0.395909 -0.075276 -0.154028 -0.171253 0.436429 -0.057082 -0.056855 0.433895 -0.057252 -0.059098 0.398391 -0.074416 -0.152627
qa: -0.4312 -0.4337 0.2821 -0.4419 -0.4406 0.2697 0.4157 0.4135 -0.1607 -0.1533 -0.1599 -0.1601 -0.1530 -0.1593 -0.4417 0.2631 0.2499 0.8258 -0.3782 0.2735 0.2696 -0.3756 0.2733 0.2662 -0.4254 0.2644 0.2479
va: 2.0690 2.0707 4.2487 2.0236 2.0194 4.2609 4.5211 4.5277 1.1399 1.1608 1.1424 1.1412 1.1612 1.1432 2.0585 0.9932 1.0694 3.3464 2.1284 0.9807 0.9866 2.1227 0.9849 0.9876 2.0757 0.9880 1.0703
dispersion: -0.033181740 hartree
energy: -2867.454742183492 hartree
dipole: 0.037921882 0.273664477 0.311586359 1.226356603 -0.393329134 0.833027469 0.149224641 -0.487842086 -0.338617446
dipolemethod: SCF
magnitude: 0.951673577 au
magnitude: 2.418961996 debye
temp: 298.15 k
press: 1.00 atm
zeropoint: 0.15223412 hartree
thermalvibcorrection: 0.02287164 hartree
thermalrotcorrection: 0.00141627 hartree
thermaltrasncorrection: 0.00141627 hartree
thermaltotal: -2867.27680388 hartree
thermalcorr: 0.02570418 hartree
nonthermalcorr: 0.15223412 hartree
totalcorr: 0.17793831 hartree
thermalcorrenthalpy: 0.00094421 hartree
totalenthalpy: -2867.27585967 hartree
vibrat: 0.04303113 hartree
rotat: 0.01637351 hartree
transl: 0.02067270 hartree
total: 0.08111463 hartree
totalentropycorr: -0.08111463 hartree
gibbsenthalpy: -2867.35697430 hartree
gibbsminuselec: 0.09776789 hartree
