program: Orca
programVersion: 6.0.0
elementType: O O C O O C C C F F F F F F Ni
charge: 0
multiplicity: 3
keywords: TPSS D3BJ TightOpt Freq def2-TZVPP def2/J RIJCOSX TightSCF defgrid3 CPCM(Acetonitrile)
frequency: 0.00 0.00 0.00 0.00 0.00 0.00 -43.24 9.70 21.12 46.01 74.35 75.26 126.09 143.42 158.34 190.04 262.55 285.05 286.00 294.01 337.08 416.84 427.06 454.80 485.44 494.61 496.37 570.54 572.59 706.98 712.94 764.42 766.53 843.38 849.71 1075.62 1076.93 1117.52 1118.22 1153.51 1158.11 1456.76 1456.99 1540.60 1540.78
frequency: 9.70 21.12 46.01 74.35 75.26 126.09 143.42 158.34 190.04 262.55 285.05 286.00 294.01 337.08 416.84 427.06 454.80 485.44 494.61 496.37 570.54 572.59 706.98 712.94 764.42 766.53 843.38 849.71 1075.62 1076.93 1117.52 1118.22 1153.51 1158.11 1456.76 1456.99 1540.60 1540.78
formula: C4F6NiO4
InChI: InChI=1/2C2F3O2.Ni/c2*3-2(4,5)1(6)7;/q2*-2;+4/rC4F6NiO4/c5-3(6,7)1-12-11(13-1)14-2(15-11)4(8,9)10
15 atoms
O  1.582625 1.961087 7.635671
O  2.809609 5.803814 7.038089
C  2.11572 5.786254 5.978373
O  2.9232 3.009948 9.036881
O  1.466488 4.754318 5.639838
C  2.271345 1.979681 8.698922
C  2.293155 0.715488 9.585798
C  2.058734 7.061454 5.108842
F  2.708383 -0.352885 8.869758
F  1.048818 0.451323 10.04612
F  3.111391 0.859597 10.642376
F  1.352982 8.022282 5.750621
F  3.301271 7.538222 4.882072
F  1.47074 6.830204 3.922127
Ni 2.196898 3.882013 7.337113
totalener: -2561.42397140344747 hartree
nucrepener: 1425.06790171478042 hartree
electener: -3986.47294543559155 hartree
oneelecener: -6388.48512464258783 hartree
twoeener: 2402.01217920699628 hartree
cpcmener: -0.01892768263633 hartree
kineticenergy: 2555.20071036171430 hartree
exchangeener: -177.117244025904 hartree
correlationener: -5.154815117618 hartree
xcener: -182.272059143522 hartree
s2: 2.001977
dispersion: -0.016065741 hartree
s2: 2.001978
dispersion: -0.016065736 hartree
dispersion: -0.016065702 hartree
dispersion: -0.016065706 hartree
elementType: O C F Ni
energy: -8137.6411 -965.2343 -841.1949 -841.0138 -840.9088 -665.6218 -665.6200 -665.6072 -665.6055 -665.6049 -665.6038 -515.1074 -515.1014 -515.0719 -515.0670 -279.0970 -279.0969 -276.2414 -276.2414 -108.9363 -71.3199 -71.0710 -70.7023 -34.0341 -34.0334 -31.8071 -31.8067 -31.7596 -31.7591 -28.9045 -28.8264 -26.2005 -26.1799 -19.2308 -19.1909 -16.3428 -16.2827 -15.1842 -15.1834 -15.1635 -15.1591 -13.5720 -13.3993 -12.6742 -12.4462 -12.1291 -12.0337 -11.8133 -11.6822 -11.6411 -11.6229 -11.5899 -11.2413 -10.7417 -10.7385 -10.6584 -10.6222 -10.1799 -10.1796 -9.9244 -9.8247 -9.0488 -8.8343 -8.5059 -8.4702 -8.2499 -8.1654 -8.0782 -7.7414 -6.5104 -2.3606 -2.1181 -0.8652 0.9888 1.5071 1.9924 2.0736 2.2114 2.7856 2.9632 3.3515 electronvolt
energy: -8137.6264 -964.3473 -840.4215 -840.2892 -840.2402 -665.6201 -665.6182 -665.6063 -665.6048 -665.6043 -665.6034 -515.0443 -515.0382 -515.0098 -515.0049 -279.0976 -279.0975 -276.2463 -276.2462 -106.8133 -69.1610 -68.8939 -68.7028 -34.0325 -34.0318 -31.8045 -31.8040 -31.7586 -31.7581 -28.8092 -28.7326 -26.0807 -26.0654 -19.2127 -19.1761 -16.3215 -16.2677 -15.1839 -15.1832 -15.1556 -15.1544 -13.5145 -13.3504 -12.3876 -12.3850 -12.0842 -12.0133 -11.7006 -11.6766 -11.6149 -11.5914 -11.4858 -11.1665 -10.7357 -10.7319 -10.6429 -10.6162 -10.1782 -10.1781 -9.1355 -8.6623 -8.6547 -8.3678 -8.1940 -7.9258 -7.7532 -7.2681 -7.2278 -5.9044 -4.2950 -2.3257 -2.0975 -0.4824 1.3753 1.5386 2.0522 2.0883 2.3598 2.9109 electronvolt
chargesum: -0.0000000
charge: -0.391632 -0.391102 0.352876 -0.381711 -0.382587 0.352336 0.409726 0.409775 -0.138856 -0.139670 -0.135223 -0.140393 -0.137900 -0.135296 0.849656
charge: 0.149692 0.149909 -0.500051 0.152854 0.152609 -0.500139 -0.634283 -0.634180 0.205356 0.203816 0.215360 0.202487 0.207175 0.214879 0.414516
qa: -0.3916 -0.3911 0.3529 -0.3817 -0.3826 0.3523 0.4097 0.4098 -0.1389 -0.1397 -0.1352 -0.1404 -0.1379 -0.1353 0.8497
va: 2.1211 2.1208 3.9966 2.1210 2.1208 3.9977 4.5679 4.5673 1.1782 1.1764 1.1893 1.1746 1.1803 1.1888 3.2376
dispersion: -0.016065703 hartree
energy: -2561.440037418446 hartree
dipole: 0.054706879 -0.023187787 0.031519093 -0.016731771 0.010602517 -0.006129254 -0.026634323 0.013856708 -0.012777615
dipolemethod: SCF
magnitude: 0.034558478 au
magnitude: 0.087840670 debye
temp: 298.15 k
press: 1.00 atm
zeropoint: 0.05368788 hartree
thermalvibcorrection: 0.01149514 hartree
thermalrotcorrection: 0.00141627 hartree
thermaltrasncorrection: 0.00141627 hartree
thermaltotal: -2561.37202186 hartree
thermalcorr: 0.01432768 hartree
nonthermalcorr: 0.05368788 hartree
totalcorr: 0.06801556 hartree
thermalcorrenthalpy: 0.00094421 hartree
totalenthalpy: -2561.37107765 hartree
vibrat: 0.02142810 hartree
rotat: 0.01568771 hartree
transl: 0.02035318 hartree
total: 0.05850628 hartree
totalentropycorr: -0.05850628 hartree
gibbsenthalpy: -2561.42958393 hartree
gibbsminuselec: 0.01045349 hartree
