program: Orca
programVersion: 6.0.1
elementType: Cu Co Co N N N N N O H C H C H C H C H C C C H C C H C H C C C H C H C H C H C O O C F F F C O O C F F F C O O C F F F C O O C F F F C O O C F F F O H H
charge: 0
multiplicity: 8
keywords: UKS b3lyp d3bj def2-TZVPP def2/J RIJCOSX VeryTightSCF defgrid3
formula: C26H14Co2CuF15N5O12
InChI: InChI=1/C16H11N5.5C2F3O2.2Co.Cu.H2O.HO/c1-3-8-17-12(5-1)14-7-10-21-11-15(20-16(21)19-14)13-6-2-4-9-18-13;5*3-2(4,5)1(6)7;;;;;/h1-11H;;;;;;;;;1H2;1H/q-4;3*-2;2*-1;+4;+5;+3;;/rC26H14Co2CuF15N5O12/c30-22(31,32)16(50)53-27-46-8-3-1-5-12(46)15-11-45-10-7-14-13-6-2-4-9-47(13)29(49(14)21(45)48(15)27)60-20(26(42,43)44)59-28(52,61(27)29,54-17(51)23(33,34)35,57-18(55-27)24(36,37)38)58-19(56-27)25(39,40)41/h1-11,61H,52H2
75 atoms
Cu 3.00993 8.198556 4.766674
Co 0.025802 10.128612 5.104048
Co 1.079145 8.457666 2.242682
N  -1.040827 11.643962 6.162154
N  1.371368 10.674574 6.559437
N  2.990386 11.135238 8.029441
N  3.41146 9.437138 6.387639
N  4.908246 7.678514 5.18081
O  1.155208 8.597399 4.290934
H  0.626071 7.815202 4.635241
C  -2.279099 12.070284 5.876036
H  -2.762632 11.581549 5.037535
C  -2.909407 13.075121 6.60481
H  -3.911945 13.387869 6.336024
C  -2.229403 13.659089 7.673485
H  -2.693101 14.444172 8.261239
C  -0.944676 13.22205 7.978996
H  -0.386893 13.653347 8.802849
C  -0.378404 12.210655 7.201114
C  0.954238 11.668746 7.415064
C  1.940578 11.968616 8.335088
H  1.993486 12.676004 9.146793
C  2.599837 10.349649 6.927817
C  4.234105 10.981825 8.573658
H  4.482784 11.606293 9.421763
C  5.074452 10.062883 8.011803
H  6.063958 9.93489 8.427232
C  4.64201 9.295525 6.902279
C  5.494319 8.314314 6.222377
C  6.817172 8.050348 6.57895
H  7.275252 8.561534 7.41636
C  7.543693 7.122564 5.837533
H  8.574014 6.906092 6.097838
C  6.933237 6.484081 4.761657
H  7.464534 5.759495 4.15581
C  5.606674 6.788736 4.466556
H  5.07998 6.31533 3.647017
C  1.995561 5.809679 3.277907
O  2.710797 6.257802 4.213488
O  1.317997 6.406361 2.414445
C  1.977084 4.25239 3.219331
F  3.233634 3.762173 3.057475
F  1.487165 3.734613 4.374912
F  1.222428 3.775806 2.208477
C  3.895385 9.329225 2.182702
O  3.883876 9.715819 3.370023
O  3.079045 8.570411 1.591139
C  5.048189 9.878304 1.291988
F  6.177516 10.109364 2.001349
F  5.37159 9.039877 0.280092
F  4.674425 11.06312 0.730696
C  -1.789369 8.964808 2.927852
O  -0.9805 8.250484 2.291697
O  -1.588937 9.832475 3.812189
C  -3.297332 8.751109 2.598029
F  -3.889197 9.92192 2.244744
F  -3.503011 7.875103 1.591887
F  -3.959614 8.279915 3.688798
C  0.993705 11.488553 2.605206
O  0.947726 10.490286 1.848771
O  0.856067 11.580516 3.849402
C  1.279837 12.854707 1.909918
F  0.289315 13.747667 2.169246
F  2.438535 13.393003 2.375611
F  1.392667 12.754882 0.56845
C  -1.010894 7.509115 6.232564
O  -0.938245 8.757205 6.413273
O  -0.427664 6.788033 5.397665
C  -1.98656 6.805463 7.226699
F  -1.600508 7.006431 8.516076
F  -3.247062 7.303529 7.105582
F  -2.064424 5.469801 7.03625
O  0.858705 8.21221 0.103556
H  1.761176 8.349335 -0.233898
H  0.333951 8.938225 -0.272337
totalener: -8079.53775504948317 hartree
kineticenergy: 8058.57497728677299 hartree
exchangeener: -481.707870790031 hartree
correlationener: -23.164542765168 hartree
xcener: -504.872413555199 hartree
s2: 15.768762
energy: -8792.3688 -7552.1174 -7552.0520 -1059.2285 -928.8459 -928.6846 -928.4826 -894.3853 -894.2837 -775.9577 -775.8467 -775.7417 -775.5310 -775.4626 -775.4426 -672.3853 -672.3374 -672.2494 -672.1632 -672.0613 -672.0396 -672.0394 -671.9241 -671.9176 -671.8387 -671.7205 -671.7174 -671.7065 -671.5957 -671.5645 -521.0570 -520.6397 -520.3472 -520.3149 -520.2682 -520.2314 -520.1585 -520.1387 -519.9133 -519.8967 -519.6184 -519.4134 -393.9684 -392.3301 -392.0330 -391.2571 -391.0067 -283.4854 -283.2338 -283.2067 -282.9197 -282.7533 -281.4131 -280.7030 -280.5860 -280.4572 -280.4357 -280.3188 -280.1146 -280.0062 -279.6728 -279.6532 -279.6361 -279.5532 -279.3754 -279.3584 -279.0932 -279.0438 -278.7806 -278.6967 -278.3977 -278.3362 -278.0573 -120.3305 -103.5465 -103.4835 -80.0603 -79.3493 -78.5057 -68.2292 -68.1633 -67.8029 -67.5318 -67.3890 -67.2252 -35.4467 -35.1730 -35.1460 -34.8811 -34.7343 -33.1865 -33.0645 -32.8918 -32.8717 -32.8408 -32.7384 -32.6012 -32.5225 -32.4630 -32.3814 -30.6379 -29.4416 -29.3754 -29.1956 -28.9119 -28.5664 -28.2725 -28.0524 -27.5155 -27.2768 -27.2138 -27.0755 -27.0057 -26.7312 -26.6988 -26.4305 -26.1486 -23.9210 -23.7295 -23.3348 -22.9939 -22.6821 -21.7601 -20.4317 -20.0902 -19.8475 -19.6198 -19.5843 -19.3358 -19.2963 -19.1013 -19.0726 -18.6588 -18.2592 -17.6821 -17.0491 -17.0079 -16.8265 -16.7788 -16.4894 -16.4351 -16.2727 -16.0551 -15.9590 -15.9355 -15.7044 -15.7005 -15.6674 -15.5948 -15.4623 -15.4225 -15.3527 -15.2893 -15.2796 -15.1960 -15.1012 -15.0103 -14.7968 -14.5490 -14.5131 -14.3206 -14.2379 -14.1602 -14.0619 -14.0039 -13.8521 -13.7927 -13.6890 -13.6246 -13.4728 -13.3604 -13.2853 -13.2359 -13.1436 -13.0962 -12.9667 -12.8057 -12.7404 -12.5945 -12.5355 -12.4874 -12.4256 -12.3983 -12.3677 -12.3478 -12.2914 -12.2581 -12.1951 -12.0966 -12.0721 -12.0415 -12.0216 -11.9924 -11.9341 -11.9074 -11.8905 -11.8224 -11.7937 -11.7282 -11.6687 -11.6607 -11.6251 -11.5511 -11.5118 -11.4479 -11.3946 -11.3500 -11.3225 -11.2798 -11.2482 -11.1985 -11.1548 -11.1036 -11.0815 -11.0463 -11.0026 -10.9692 -10.8734 -10.8386 -10.8148 -10.7492 -10.5934 -10.5758 -10.5501 -10.5195 -10.4249 -10.3966 -10.2233 -10.0415 -9.9272 -9.8313 -9.7237 -9.6800 -9.5949 -9.5492 -9.5298 -9.2773 -9.1675 -9.0960 -8.9321 -8.8621 -8.8356 -8.5909 -8.5201 -8.4015 -8.3683 -8.3315 -8.2284 -8.0271 -7.9341 -7.8765 -7.8481 -7.7798 -7.6777 -7.6396 -7.5486 -7.5128 -7.3812 -7.0687 -6.7531 -6.6963 -6.3824 -6.3564 -4.2165 -2.8629 -2.6317 -2.2010 -1.8240 -1.2317 -0.4512 -0.3909 -0.2245 -0.0869 0.0106 electronvolt
energy: -8792.3583 -7552.0851 -7552.0197 -1058.6655 -928.2991 -928.1922 -928.1349 -892.6151 -892.5086 -774.3606 -774.2626 -774.2547 -774.1293 -774.1084 -774.0759 -672.3848 -672.3373 -672.2489 -672.1626 -672.0608 -672.0389 -672.0384 -671.9221 -671.9169 -671.8381 -671.7199 -671.7175 -671.7056 -671.5954 -671.5634 -521.0211 -520.5699 -520.3085 -520.3044 -520.2221 -520.1882 -520.1144 -519.9440 -519.8615 -519.8569 -519.5706 -519.4094 -393.9641 -392.2908 -391.9758 -391.2157 -390.9636 -283.4816 -283.2237 -283.2001 -282.9125 -282.7498 -281.4141 -280.7050 -280.5896 -280.4582 -280.4396 -280.3179 -280.1152 -280.0080 -279.6732 -279.6543 -279.6364 -279.5550 -279.3770 -279.3567 -279.0945 -279.0429 -278.7780 -278.6986 -278.3993 -278.3349 -278.0550 -119.1877 -99.5363 -99.4532 -78.1267 -78.1219 -78.0612 -63.5794 -63.5214 -63.5170 -63.4619 -63.4149 -63.3865 -35.4454 -35.1705 -35.1422 -34.8786 -34.7330 -33.1857 -33.0634 -32.8894 -32.8697 -32.8393 -32.7353 -32.5994 -32.5208 -32.4625 -32.3799 -30.6191 -29.3763 -29.3060 -29.1281 -28.8406 -28.5219 -28.2263 -27.9870 -27.4647 -27.2409 -27.1003 -27.0217 -26.9217 -26.6774 -26.6213 -26.2726 -25.8365 -23.9051 -23.7170 -23.3222 -22.9806 -22.6734 -21.7538 -20.4154 -20.0764 -19.8321 -19.5765 -19.5557 -19.3208 -19.2669 -19.0848 -19.0517 -18.6414 -18.2458 -17.6610 -17.0281 -16.9872 -16.7750 -16.7406 -16.4482 -16.3959 -16.2470 -16.0366 -15.9554 -15.9327 -15.6981 -15.6972 -15.6568 -15.5816 -15.4384 -15.4178 -15.3439 -15.2862 -15.2545 -15.1905 -15.0927 -14.9744 -14.7744 -14.5310 -14.4223 -14.2967 -14.1555 -14.0968 -14.0141 -13.9210 -13.8197 -13.7282 -13.5265 -13.3871 -13.3014 -13.2090 -13.1224 -13.0913 -12.9593 -12.8739 -12.8168 -12.7257 -12.6660 -12.5727 -12.4751 -12.4309 -12.3980 -12.3294 -12.3218 -12.2608 -12.1885 -12.1481 -12.0617 -12.0261 -12.0134 -11.9743 -11.9504 -11.8992 -11.8635 -11.8065 -11.7218 -11.6799 -11.6485 -11.6061 -11.5278 -11.4819 -11.4687 -11.4138 -11.3717 -11.3476 -11.3111 -11.2682 -11.2436 -11.1582 -11.1277 -11.1010 -11.0673 -11.0148 -10.9763 -10.9199 -10.8498 -10.8245 -10.7903 -10.7510 -10.7045 -10.5528 -10.5293 -10.5139 -10.3933 -10.2250 -9.8757 -9.7836 -9.6572 -9.5817 -9.4283 -9.4189 -9.2292 -9.2131 -9.0738 -8.9363 -8.6664 -8.5353 -8.4458 -8.3589 -8.3008 -8.2299 -8.1566 -8.1117 -7.9553 -7.9425 -7.7781 -7.6968 -7.6529 -7.5856 -7.5424 -7.4011 -7.1139 -6.4229 -6.4026 -6.2835 -6.2330 -4.1925 -3.5925 -2.8766 -2.6165 -2.1795 -1.9197 -1.6416 -1.4151 -1.1702 -0.4764 -0.4529 electronvolt
chargesum: -0.0000000
charge: 0.548889 1.072203 1.116664 -0.183269 -0.155672 -0.027025 -0.153968 -0.023028 -0.892339 0.307883 -0.005925 0.167282 -0.109883 0.154022 -0.108982 0.151009 -0.126400 0.122073 0.077051 0.145500 -0.066513 0.179285 0.210404 -0.001440 0.163420 -0.132848 0.145931 0.178275 0.145834 -0.124843 0.135364 -0.101695 0.160235 -0.104335 0.164596 0.003489 0.161913 0.306828 -0.500081 -0.384718 0.500043 -0.193098 -0.169851 -0.160769 0.354777 -0.459120 -0.490565 0.496598 -0.183693 -0.175467 -0.175899 0.290470 -0.413868 -0.524066 0.501114 -0.190407 -0.168365 -0.181424 0.308942 -0.458375 -0.480466 0.501457 -0.184579 -0.185862 -0.176401 0.249874 -0.491965 -0.426342 0.500556 -0.195574 -0.184057 -0.170566 -0.311105 0.211559 0.221309
charge: -0.045018 -0.096160 -0.062616 0.295949 0.280964 0.352599 0.292735 0.293590 0.185172 -0.170642 -0.009450 0.033904 0.012335 0.029299 0.025952 0.028894 0.018099 0.023455 -0.112663 -0.113617 -0.026063 0.011746 -0.226248 0.011374 0.033703 0.003111 0.029992 -0.090398 -0.101140 0.028283 0.024984 0.038405 0.033646 0.024934 0.034244 0.002846 0.040047 -0.484047 0.149283 0.194994 -0.592774 0.167283 0.184142 0.199095 -0.522777 0.126886 0.136428 -0.594610 0.177200 0.181721 0.175157 -0.497955 0.169835 0.148649 -0.592516 0.168735 0.191285 0.175330 -0.493331 0.156130 0.146934 -0.593672 0.172763 0.172402 0.187793 -0.542076 0.109170 0.102471 -0.592875 0.161459 0.170005 0.186933 0.423953 -0.084646 -0.081001
qa: 0.5489 1.0722 1.1167 -0.1833 -0.1557 -0.0270 -0.1540 -0.0230 -0.8923 0.3079 -0.0059 0.1673 -0.1099 0.1540 -0.1090 0.1510 -0.1264 0.1221 0.0771 0.1455 -0.0665 0.1793 0.2104 -0.0014 0.1634 -0.1328 0.1459 0.1783 0.1458 -0.1248 0.1354 -0.1017 0.1602 -0.1043 0.1646 0.0035 0.1619 0.3068 -0.5001 -0.3847 0.5000 -0.1931 -0.1699 -0.1608 0.3548 -0.4591 -0.4906 0.4966 -0.1837 -0.1755 -0.1759 0.2905 -0.4139 -0.5241 0.5011 -0.1904 -0.1684 -0.1814 0.3089 -0.4584 -0.4805 0.5015 -0.1846 -0.1859 -0.1764 0.2499 -0.4920 -0.4263 0.5006 -0.1956 -0.1841 -0.1706 -0.3111 0.2116 0.2213
va: 2.4396 4.1110 4.1705 3.0384 2.9274 3.5426 3.1263 3.1823 1.5509 1.0215 3.9977 1.0111 3.8995 0.9920 3.9555 0.9940 3.9685 1.0064 3.9423 3.9976 3.9118 0.9926 4.0969 3.9370 0.9957 3.9441 1.0103 3.9447 3.8408 3.9691 1.0095 3.9709 0.9909 3.9147 0.9889 4.0045 1.0116 4.1910 1.9663 2.0629 4.4777 1.0993 1.1340 1.1538 4.0480 1.9544 1.9374 4.5019 1.1148 1.1253 1.1231 4.2255 2.0263 1.9043 4.4478 1.1026 1.1428 1.1180 4.1983 1.9474 1.9556 4.4734 1.1152 1.1103 1.1321 4.2442 1.9094 2.0676 4.4702 1.0932 1.1091 1.1375 2.1448 1.0366 1.0248
dispersion: -0.209655839 hartree
energy: -8079.747410887990 hartree
dipole: 23.504201910 -17.851358008 5.652843902 22.523507613 -18.807857876 3.715649737 37.892579389 -32.100501010 5.792078379
dipolemethod: SCF
magnitude: 8.905552711 au
magnitude: 22.636116071 debye
