program: Orca
programVersion: 6.0.1
elementType: Co Co Cu N N N N N O O O O O O O O O O O C C C C C C C C C H C C C H C H C H C H C H C H C H C H C C H C C C C H F F F F F F F F F F F F O H H C F F F H
charge: 0
multiplicity: 8
keywords: UKS b3lyp d3bj def2-TZVPP def2/J RIJCOSX VeryTightSCF defgrid3
formula: C26H14Co2CuF15N5O12
InChI: InChI=1/C16H11N5.5C2F3O2.2Co.Cu.H2O.HO/c1-3-8-17-12(5-1)14-7-10-21-11-15(20-16(21)19-14)13-6-2-4-9-18-13;5*3-2(4,5)1(6)7;;;;;/h1-11H;;;;;;;;;1H2;1H/q-4;4*-2;-1;+4;+5;+4;;/rC26H12Co2CuF15N5O11.H2O/c30-22(31,32)16(50)53-28-47-9-4-2-6-13(47)14-7-10-45-11-15-12-5-1-3-8-46(12)27(48(15)21(45)49(14)28)51-17(23(33,34)35)56-29(60(27)28,57-18(52-27)24(36,37)38,58-19(54-28)25(39,40)41)59-20(55-28)26(42,43)44;/h1-11,60H;1H2
75 atoms
Co 8.193669 11.563247 13.682493
Co 8.355716 7.966828 13.51621
Cu 8.521427 9.832636 10.770656
N  8.499878 13.424785 14.604659
N  8.771697 6.149211 14.531643
N  9.108046 8.648241 15.329658
N  9.914249 9.545986 17.212729
N  9.100674 11.041947 15.519325
O  7.829584 9.776003 12.835862
O  7.114132 11.134599 10.220507
O  10.050996 8.569219 10.593283
O  7.370253 12.562341 11.97844
O  9.889806 11.27382 10.67383
O  7.633737 6.911157 11.834587
O  10.324246 7.946166 12.76654
O  6.22311 11.662258 14.476156
O  10.148621 11.72658 12.891524
O  7.281427 8.401266 10.146719
O  5.149942 10.049717 13.280877
C  10.645217 8.024159 11.560825
C  6.892887 12.179034 10.889886
C  9.12294 13.403911 15.806557
C  5.222292 11.011659 14.086215
C  7.164665 7.296837 10.743154
C  9.515432 7.651363 16.189126
C  10.437442 11.801724 11.677458
C  9.420519 12.064853 16.328127
C  8.184035 14.604114 14.053276
H  7.684691 14.555278 13.09285
C  9.351164 6.275061 15.750779
C  9.345462 9.79742 15.949208
C  8.574587 4.919277 14.032444
H  8.109833 4.876795 13.053882
C  9.446785 14.582716 16.483263
H  9.949001 14.552456 17.442082
C  9.7458 5.165395 16.500687
H  10.207592 5.300881 17.472135
C  8.47695 15.818441 14.668859
H  8.202489 16.747992 14.183508
C  10.020038 8.18428 17.358431
H  10.427091 7.735739 18.250321
C  9.119852 15.804957 15.904099
H  9.365095 16.73107 16.412637
C  8.942619 3.767206 14.720319
H  8.76377 2.794574 14.276504
C  10.001058 11.852671 17.604346
H  10.251697 12.682768 18.248943
C  12.004761 7.347192 11.212832
C  9.537473 3.894631 15.97569
H  9.83606 3.016207 16.53785
C  6.249503 6.284011 9.989424
C  3.851739 11.453492 14.688651
C  5.839574 13.151609 10.277124
C  10.242977 10.582726 18.040539
H  10.676733 10.330296 18.999271
F  6.358084 5.030484 10.476704
F  3.949558 12.497565 15.540516
F  2.987513 11.815836 13.703603
F  4.947182 6.658229 10.112024
F  6.357057 14.399452 10.148266
F  4.757819 13.244857 11.094263
F  3.274074 10.428204 15.371096
F  12.285542 7.362637 9.894013
F  13.020525 7.981186 11.855208
F  5.399038 12.76616 9.062167
F  12.014033 6.052876 11.618889
F  6.535088 6.235911 8.667115
O  6.280097 7.701973 14.245724
H  5.906716 6.924998 13.798819
H  5.74433 8.464049 13.921285
C  11.672567 12.699927 11.367099
F  11.983366 12.746774 10.055784
F  11.444026 13.973678 11.779771
F  12.76686 12.249227 12.031772
H  6.847802 9.7971 12.741674
totalener: -8079.54980824870472 hartree
kineticenergy: 8058.60864604540075 hartree
exchangeener: -481.710881228148 hartree
correlationener: -23.167355847405 hartree
xcener: -504.878237075554 hartree
s2: 15.774548
energy: -8791.7862 -7552.5028 -7552.4923 -1058.6479 -928.2001 -928.1984 -927.8609 -894.7713 -894.7440 -776.3393 -776.3245 -776.0839 -776.0494 -775.8774 -775.8481 -672.3925 -672.2820 -672.2766 -672.2239 -672.2215 -672.2192 -672.1566 -672.1502 -672.1310 -672.0656 -672.0431 -672.0404 -671.9646 -671.9064 -671.9020 -521.2293 -520.6466 -520.6201 -520.6194 -520.5834 -520.4482 -520.4193 -520.3998 -520.2236 -520.2110 -519.9119 -519.7931 -393.8110 -391.9430 -391.3656 -391.3022 -391.2440 -283.4595 -283.4235 -283.4040 -283.1804 -283.1551 -281.2836 -280.6329 -280.5720 -280.5456 -280.4870 -280.3567 -280.2859 -280.2470 -279.6513 -279.6170 -279.6124 -279.5902 -279.1325 -279.0705 -278.9539 -278.6893 -278.6400 -278.6097 -278.5824 -278.3503 -278.3248 -119.8120 -103.9185 -103.9054 -79.2860 -79.2770 -77.8024 -68.6126 -68.5974 -68.0875 -68.0653 -67.6831 -67.6599 -35.4075 -35.3618 -35.3499 -35.1180 -35.1146 -33.1557 -33.0691 -33.0585 -33.0099 -32.9993 -32.9916 -32.8529 -32.8343 -32.7547 -32.7384 -30.4825 -29.6372 -29.5238 -29.4722 -29.2880 -29.0965 -28.2037 -27.8320 -27.4833 -27.3957 -27.3283 -27.2689 -27.1108 -26.9825 -26.8259 -26.7696 -26.0724 -23.6650 -23.3307 -23.2934 -23.0885 -22.6399 -21.6297 -20.3106 -19.8589 -19.8072 -19.7921 -19.7821 -19.5600 -19.5061 -19.3577 -18.6936 -18.6000 -18.1864 -17.6785 -17.0898 -16.9942 -16.9719 -16.8728 -16.7625 -16.6836 -16.0945 -16.0395 -15.9380 -15.9048 -15.8955 -15.8671 -15.8344 -15.8141 -15.6614 -15.6444 -15.6026 -15.5805 -15.4016 -15.1809 -15.1174 -14.9501 -14.7092 -14.5713 -14.4497 -14.3491 -14.3231 -14.2771 -14.1810 -14.0683 -13.9634 -13.9157 -13.8971 -13.7589 -13.7075 -13.5292 -13.3840 -13.2211 -13.0690 -12.9031 -12.8406 -12.8176 -12.7409 -12.6961 -12.6761 -12.6349 -12.6034 -12.5562 -12.5421 -12.5381 -12.5194 -12.4626 -12.4135 -12.3735 -12.3025 -12.2541 -12.2061 -12.0773 -11.9854 -11.9500 -11.8979 -11.8655 -11.8139 -11.7521 -11.7044 -11.6519 -11.6261 -11.6024 -11.5565 -11.4981 -11.4846 -11.4713 -11.4410 -11.4180 -11.3952 -11.3416 -11.3086 -11.2961 -11.2330 -11.2076 -11.1359 -11.0877 -11.0202 -10.9897 -10.9833 -10.9656 -10.9055 -10.7907 -10.7678 -10.7388 -10.4926 -10.4431 -10.2143 -10.1028 -9.9159 -9.8227 -9.7529 -9.6908 -9.6055 -9.5635 -9.3778 -9.3521 -9.2838 -9.1400 -8.9528 -8.8663 -8.7824 -8.7647 -8.6772 -8.6195 -8.5590 -8.4782 -8.3687 -8.3182 -8.2746 -8.1592 -8.1228 -7.9955 -7.9726 -7.9613 -7.7832 -7.5369 -7.4217 -7.4050 -7.1445 -6.9754 -6.8779 -6.4581 -3.9170 -2.7871 -2.3526 -2.1080 -1.9866 -0.9840 -0.5073 -0.4281 -0.2848 -0.1883 -0.1599 electronvolt
energy: -8791.7754 -7552.4702 -7552.4599 -1058.0429 -927.6959 -927.5372 -927.5360 -893.0033 -892.9853 -774.7493 -774.7332 -774.6265 -774.6096 -774.5409 -774.5183 -672.3909 -672.2810 -672.2755 -672.2229 -672.2208 -672.2181 -672.1563 -672.1494 -672.1303 -672.0645 -672.0429 -672.0405 -671.9635 -671.9055 -671.9014 -521.1915 -520.5826 -520.5820 -520.5523 -520.5183 -520.4067 -520.3599 -520.3482 -520.1872 -520.1657 -519.9104 -519.6699 -393.8061 -391.8994 -391.3265 -391.2631 -391.2002 -283.4511 -283.4150 -283.3956 -283.1716 -283.1516 -281.2857 -280.6353 -280.5739 -280.5469 -280.4926 -280.3592 -280.2940 -280.2471 -279.6524 -279.6190 -279.6120 -279.5895 -279.1292 -279.0713 -278.9550 -278.6904 -278.6407 -278.6101 -278.5815 -278.3484 -278.3239 -118.5776 -99.9175 -99.9130 -77.5335 -77.5296 -77.4057 -63.9767 -63.9730 -63.8751 -63.8676 -63.8603 -63.8463 -35.4043 -35.3585 -35.3465 -35.1150 -35.1130 -33.1529 -33.0667 -33.0559 -33.0076 -32.9971 -32.9903 -32.8526 -32.8316 -32.7524 -32.7369 -30.4640 -29.5561 -29.4394 -29.3869 -29.2029 -29.0550 -28.1349 -27.7938 -27.4383 -27.2987 -27.2210 -27.1582 -27.0021 -26.9353 -26.7788 -26.7335 -25.8119 -23.6553 -23.3186 -23.2838 -23.0746 -22.6344 -21.6242 -20.2972 -19.8231 -19.7866 -19.7628 -19.7446 -19.5230 -19.4902 -19.3414 -18.6807 -18.5853 -18.1728 -17.6583 -17.0477 -16.9505 -16.9207 -16.8495 -16.7185 -16.6563 -16.0661 -16.0191 -15.9271 -15.9005 -15.8910 -15.8623 -15.8221 -15.8012 -15.6559 -15.6416 -15.5969 -15.5697 -15.3758 -15.1511 -15.0947 -14.9433 -14.6825 -14.5055 -14.3606 -14.3111 -14.2531 -14.1547 -14.1293 -13.9877 -13.9167 -13.8644 -13.7910 -13.6410 -13.3352 -13.3013 -13.1008 -13.0365 -12.9979 -12.8394 -12.7862 -12.7704 -12.6749 -12.6358 -12.5980 -12.5471 -12.5203 -12.5078 -12.4958 -12.4720 -12.4165 -12.3998 -12.3852 -12.3496 -12.2764 -12.1921 -12.1611 -12.0199 -11.9155 -11.8591 -11.7900 -11.7355 -11.6946 -11.6559 -11.6171 -11.5696 -11.5446 -11.4943 -11.4743 -11.4610 -11.4330 -11.4218 -11.3898 -11.3376 -11.3075 -11.2975 -11.2339 -11.1930 -11.0870 -11.0193 -11.0107 -10.9823 -10.9728 -10.9446 -10.7674 -10.7376 -10.6196 -10.2440 -10.1376 -9.9493 -9.6894 -9.6866 -9.6430 -9.5110 -9.4621 -9.3474 -9.3001 -9.0942 -9.0518 -8.8318 -8.7098 -8.6525 -8.5762 -8.4634 -8.4015 -8.3681 -8.3129 -8.2466 -8.1623 -8.1051 -8.0590 -8.0145 -8.0021 -7.8672 -7.6812 -7.5809 -7.2665 -6.8734 -6.8001 -6.6741 -6.5911 -3.8807 -2.9148 -2.8151 -2.3931 -2.3008 -2.0808 -1.8774 -1.6850 -0.9791 -0.8573 -0.7168 electronvolt
chargesum: -0.0000000
charge: 1.155826 1.100360 0.665467 -0.136151 -0.198505 -0.222554 -0.025321 -0.203125 -0.946205 -0.368686 -0.375366 -0.539308 -0.377668 -0.512985 -0.477376 -0.458384 -0.478697 -0.364733 -0.496531 0.304800 0.341409 0.115567 0.277329 0.324346 0.145190 0.317305 0.166233 -0.004102 0.172269 0.072744 0.243783 -0.025849 0.170424 -0.132622 0.128448 -0.127722 0.126342 -0.109580 0.158866 -0.068594 0.176224 -0.100462 0.154793 -0.120466 0.155652 -0.126296 0.144793 0.501240 -0.105092 0.154462 0.493188 0.501835 0.503379 -0.009877 0.161098 -0.180311 -0.179593 -0.174078 -0.175859 -0.186324 -0.178215 -0.187970 -0.162042 -0.179778 -0.162667 -0.184553 -0.165038 -0.400040 0.213079 0.250032 0.502943 -0.161682 -0.186710 -0.179208 0.256896
charge: -0.079094 -0.087945 -0.036448 0.294803 0.283371 0.269301 0.350205 0.295882 0.162847 0.180475 0.182271 0.156576 0.184390 0.149486 0.156325 0.131261 0.151258 0.185655 0.074824 -0.486765 -0.484946 -0.108536 -0.535978 -0.484582 -0.127150 -0.486135 -0.086195 -0.004450 0.031815 -0.110914 -0.226587 -0.024522 0.029658 0.021897 0.021541 0.021046 0.025483 0.019880 0.031665 -0.031372 0.010946 0.030155 0.030593 0.008245 0.029463 0.004970 0.029565 -0.594483 0.028885 0.030400 -0.596036 -0.595658 -0.593189 0.005259 0.031957 0.182648 0.181476 0.178491 0.177774 0.173589 0.179130 0.168040 0.197088 0.176361 0.197024 0.174910 0.190334 0.389471 -0.093835 -0.127208 -0.594139 0.197293 0.172496 0.177443 -0.169755
qa: 1.1558 1.1004 0.6655 -0.1362 -0.1985 -0.2226 -0.0253 -0.2031 -0.9462 -0.3687 -0.3754 -0.5393 -0.3777 -0.5130 -0.4774 -0.4584 -0.4787 -0.3647 -0.4965 0.3048 0.3414 0.1156 0.2773 0.3243 0.1452 0.3173 0.1662 -0.0041 0.1723 0.0727 0.2438 -0.0258 0.1704 -0.1326 0.1284 -0.1277 0.1263 -0.1096 0.1589 -0.0686 0.1762 -0.1005 0.1548 -0.1205 0.1557 -0.1263 0.1448 0.5012 -0.1051 0.1545 0.4932 0.5018 0.5034 -0.0099 0.1611 -0.1803 -0.1796 -0.1741 -0.1759 -0.1863 -0.1782 -0.1880 -0.1620 -0.1798 -0.1627 -0.1846 -0.1650 -0.4000 0.2131 0.2500 0.5029 -0.1617 -0.1867 -0.1792 0.2569
va: 4.0024 4.0370 2.5278 3.0708 3.0645 2.9180 3.5347 2.9869 1.4490 2.0854 2.0711 1.8901 2.0753 1.8878 1.9708 1.9331 1.9692 2.0936 1.9739 4.1538 4.1322 3.9019 4.2008 4.1614 3.9828 4.1348 3.9527 3.9932 1.0128 3.9431 4.0427 4.0003 1.0083 3.9785 1.0107 3.9705 1.0063 3.9075 0.9905 3.9098 0.9939 3.9521 0.9924 3.9247 0.9925 3.9395 1.0108 4.4895 3.9534 0.9932 4.4774 4.4666 4.4511 3.9352 0.9967 1.1161 1.1220 1.1254 1.1229 1.1084 1.1208 1.1077 1.1500 1.1178 1.1518 1.1124 1.1438 2.0761 1.0334 1.0494 4.4863 1.1510 1.1077 1.1191 1.0560
dispersion: -0.210049875 hartree
energy: -8079.759858123315 hartree
dipole: 10.967029126 -8.160885154 2.806143972 -5.861621793 5.048504832 -0.813116961 61.065683247 -52.701930936 8.363752310
dipolemethod: SCF
magnitude: 8.859342859 au
magnitude: 22.518659960 debye
