program: Orca
programVersion: 6.0.1
elementType: Cu Ni Ni N N N N N C H C H C H C H C C C H C H C C H C C C H C H C H C H O H O O C C F F F O O C C F F F O O C C F F F O O C C F F F O O C C F F F O H H
charge: 0
multiplicity: 6
keywords: UKS b3lyp d3bj def2-TZVPP def2/J RIJCOSX VeryTightSCF defgrid3
formula: C26H14CuF15N5Ni2O12
InChI: InChI=1/C16H11N5.5C2F3O2.Cu.2Ni.H2O.HO/c1-3-8-17-12(5-1)14-7-10-21-11-15(20-16(21)19-14)13-6-2-4-9-18-13;5*3-2(4,5)1(6)7;;;;;/h1-11H;;;;;;;;;1H2;1H/q-4;3*-2;2*-1;+3;+4;+5;;/rC26H14CuF15N5Ni2O12/c28-22(29,30)16(50)54-48-45-9-4-2-6-13(45)14-7-10-43-11-15-12-5-1-3-8-44(12)27(46(15)21(43)47(14)48)53-18(24(34,35)36)58-49(52,61(27)48,55-17(51)23(31,32)33,59-19(56-48)25(37,38)39)60-20(57-48)26(40,41)42/h1-11,61H,52H2
75 atoms
Cu 11.04903 4.775883 18.08039
Ni 9.591396 8.041828 18.143038
Ni 8.278159 5.131342 19.406693
N  9.331394 9.971147 17.470035
N  10.775146 8.039041 16.448148
N  11.545053 5.766884 16.452007
N  12.087954 7.043466 14.709386
N  12.117409 3.327923 17.158276
C  8.604454 10.911754 18.081724
H  8.088191 10.596354 18.980596
C  8.515294 12.215797 17.596512
H  7.912083 12.945397 18.124503
C  9.210603 12.549794 16.438202
H  9.167484 13.555664 16.034976
C  9.969038 11.572566 15.799047
H  10.522985 11.812466 14.89996
C  10.008417 10.286637 16.340901
C  10.769506 9.18073 15.744988
C  11.439889 9.285934 14.500707
H  11.4305 10.207996 13.937188
C  12.097626 8.204898 13.988557
H  12.627339 8.194156 13.045007
C  11.417489 6.985841 15.941137
C  12.644999 5.806603 14.471088
H  13.220363 5.600382 13.583175
C  12.302185 5.036561 15.559873
C  12.604317 3.667996 15.9379
C  13.326266 2.764405 15.160754
H  13.702096 3.063049 14.188773
C  13.54998 1.484943 15.660078
H  14.10851 0.762417 15.074849
C  13.050132 1.144373 16.916146
H  13.204619 0.158198 17.337807
C  12.336029 2.096097 17.637027
H  11.924782 1.886318 18.616888
O  9.933172 6.169104 18.875361
H  10.389968 6.436681 19.726271
O  11.367513 3.908814 19.842237
O  9.342549 4.136057 20.86717
C  10.53863 3.794368 20.789102
C  11.154088 3.115301 22.049649
F  11.661948 1.894679 21.742229
F  10.255417 2.945135 23.039336
F  12.172383 3.865446 22.543848
O  6.948485 5.893698 18.047234
O  8.08653 7.466427 16.853171
C  7.155811 6.65921 17.076189
C  6.092455 6.542075 15.941949
F  6.356372 5.442295 15.180339
F  6.084487 7.610219 15.114553
F  4.838679 6.398247 16.432285
O  8.315546 8.421955 19.723022
O  7.732642 6.499848 20.813284
C  7.8298 7.739924 20.657078
C  7.265757 8.613705 21.81975
F  6.357265 9.512225 21.358415
F  6.662388 7.889809 22.785784
F  8.267281 9.321829 22.407953
O  11.145802 8.801342 19.30889
O  11.195567 7.22701 20.950758
C  11.492629 8.317936 20.424122
C  12.416608 9.277462 21.237225
F  13.481503 9.690243 20.500704
F  12.90348 8.711017 22.36335
F  11.732513 10.394352 21.611683
O  8.887996 3.81492 17.921586
O  7.059855 2.484623 17.762814
C  8.141687 2.949596 17.366594
C  8.689064 2.393987 16.015415
F  9.371233 3.327376 15.309244
F  9.540043 1.354817 16.241729
F  7.698072 1.93358 15.220167
O  6.642201 3.929829 19.96541
H  5.846735 4.473977 19.846155
H  6.6452 3.301716 19.186197
totalener: -8330.64614556023844 hartree
kineticenergy: 8309.31781324756412 hartree
exchangeener: -487.690324701571 hartree
correlationener: -23.328995802708 hartree
xcener: -511.019320504280 hartree
s2: 8.761574
energy: -8792.4459 -8160.2997 -8159.7583 -1058.7769 -973.6863 -973.1026 -928.4214 -928.2783 -928.2588 -849.2942 -849.2861 -849.2719 -848.7094 -848.7054 -848.6931 -672.6679 -672.5962 -672.3005 -672.2630 -672.2081 -672.1426 -672.1355 -671.9255 -671.9067 -671.8883 -671.8399 -671.7693 -671.7358 -671.7297 -671.6716 -520.6105 -520.3841 -520.3777 -520.2193 -520.1976 -520.1286 -520.0021 -519.9926 -519.9230 -519.9092 -519.7747 -519.5091 -394.1859 -392.1701 -391.8762 -391.8166 -391.3933 -283.5867 -283.3529 -283.2031 -282.9657 -282.8769 -281.7339 -280.8089 -280.6040 -280.4291 -280.4218 -280.3361 -280.0885 -280.0543 -280.0413 -279.9848 -279.8047 -279.7501 -279.4230 -279.4132 -279.0442 -278.9789 -278.8907 -278.7627 -278.7425 -278.6105 -278.4495 -119.2854 -108.9080 -108.3561 -78.2319 -78.1910 -78.1707 -70.4231 -70.3751 -70.3623 -69.8502 -69.8461 -69.8190 -35.6539 -35.3290 -35.1247 -34.9345 -34.8583 -33.4423 -33.2181 -33.0545 -32.9669 -32.8688 -32.7188 -32.6680 -32.5904 -32.5593 -32.5010 -30.8885 -29.3505 -29.2943 -29.1506 -28.9199 -28.6613 -28.1301 -27.8470 -27.1689 -27.1562 -27.1466 -27.0950 -27.0467 -26.7980 -26.7252 -26.4115 -25.9257 -23.9766 -23.6382 -23.4926 -23.3358 -22.9158 -21.9096 -20.6372 -20.0839 -19.9314 -19.7282 -19.6982 -19.5638 -19.3141 -19.2089 -18.9897 -18.7678 -18.4307 -17.9687 -17.1854 -17.1101 -16.8999 -16.7667 -16.5186 -16.4023 -16.3787 -16.2706 -16.2383 -16.0581 -15.8522 -15.8101 -15.6978 -15.6759 -15.5622 -15.4813 -15.4122 -15.3870 -15.3457 -15.3325 -15.3088 -14.9879 -14.5611 -14.5045 -14.4301 -14.3623 -14.3212 -14.2169 -14.1819 -14.1272 -14.0513 -13.8225 -13.5609 -13.5279 -13.4157 -13.2813 -13.2284 -13.1693 -13.0139 -12.9203 -12.8881 -12.8273 -12.7334 -12.7062 -12.6432 -12.4933 -12.4819 -12.4445 -12.4311 -12.3338 -12.2997 -12.2388 -12.1536 -12.1439 -12.1179 -12.0795 -12.0490 -11.9651 -11.9056 -11.8546 -11.8172 -11.8029 -11.7695 -11.7228 -11.7064 -11.6640 -11.6029 -11.5819 -11.5264 -11.4249 -11.3834 -11.3209 -11.2916 -11.2537 -11.2128 -11.1261 -11.0839 -11.0624 -10.9816 -10.9709 -10.9611 -10.8792 -10.7933 -10.7224 -10.7053 -10.6209 -10.5683 -10.5205 -10.5112 -10.1711 -10.0051 -9.9737 -9.8277 -9.6884 -9.6642 -9.4988 -9.3733 -9.2545 -9.0044 -8.9238 -8.8183 -8.7376 -8.6067 -8.5406 -8.4595 -8.4064 -8.3169 -8.2134 -8.0865 -8.0268 -7.9526 -7.8815 -7.8561 -7.7870 -7.7004 -7.6369 -7.6078 -7.5599 -7.3257 -7.2366 -7.1832 -7.0529 -7.0114 -4.1628 -3.3950 -3.0915 -2.6865 -2.2863 -2.1704 -1.3446 -1.2364 -1.1688 -0.8007 -0.7188 electronvolt
chargesum: -0.0000000
charge: 0.449110 1.051227 1.124260 -0.117224 -0.151460 -0.139793 -0.025364 -0.097748 0.002890 0.175252 -0.103750 0.161603 -0.104517 0.156185 -0.123107 0.129169 0.098791 0.173716 -0.121038 0.149191 -0.006147 0.165009 0.235274 -0.052910 0.182917 0.226615 0.057501 -0.130701 0.132316 -0.107057 0.158525 -0.087204 0.160592 -0.011228 0.162956 -0.869068 0.296289 -0.466636 -0.372345 0.341028 0.504642 -0.190224 -0.158538 -0.170373 -0.451737 -0.460128 0.284082 0.498845 -0.184440 -0.180638 -0.172099 -0.551856 -0.401893 0.304523 0.503995 -0.192918 -0.165712 -0.181252 -0.489674 -0.423547 0.260885 0.501830 -0.193157 -0.168871 -0.187543 -0.549067 -0.391027 0.259767 0.544905 -0.201865 -0.200265 -0.163591 -0.377393 0.213402 0.227811
charge: -0.027704 -0.143333 -0.113561 0.309326 0.309699 0.260283 0.353497 0.286199 0.001161 0.032481 0.023928 0.032657 0.030689 0.031005 0.023574 0.022038 -0.107132 -0.075357 0.012278 0.031885 0.011487 0.033836 -0.217689 -0.022116 0.014109 -0.125703 -0.110174 0.026690 0.027785 0.038450 0.033079 0.019130 0.033123 -0.002107 0.038594 0.203490 -0.170036 0.149409 0.209340 -0.477744 -0.593982 0.169715 0.201579 0.183691 0.167179 0.153074 -0.498722 -0.593235 0.169624 0.180235 0.184735 0.158024 0.181685 -0.495121 -0.592241 0.167179 0.193738 0.175420 0.113871 0.102044 -0.540297 -0.593449 0.164336 0.188389 0.167104 0.171879 0.112351 -0.519546 -0.590244 0.181329 0.169664 0.194563 0.397909 -0.093100 -0.145946
qa: 0.4491 1.0512 1.1243 -0.1172 -0.1515 -0.1398 -0.0254 -0.0977 0.0029 0.1753 -0.1038 0.1616 -0.1045 0.1562 -0.1231 0.1292 0.0988 0.1737 -0.1210 0.1492 -0.0061 0.1650 0.2353 -0.0529 0.1829 0.2266 0.0575 -0.1307 0.1323 -0.1071 0.1585 -0.0872 0.1606 -0.0112 0.1630 -0.8691 0.2963 -0.4666 -0.3723 0.3410 0.5046 -0.1902 -0.1585 -0.1704 -0.4517 -0.4601 0.2841 0.4988 -0.1844 -0.1806 -0.1721 -0.5519 -0.4019 0.3045 0.5040 -0.1929 -0.1657 -0.1813 -0.4897 -0.4235 0.2609 0.5018 -0.1932 -0.1689 -0.1875 -0.5491 -0.3910 0.2598 0.5449 -0.2019 -0.2003 -0.1636 -0.3774 0.2134 0.2278
va: 2.5249 3.0983 3.0366 3.0621 2.9570 3.1396 3.5406 3.1846 3.9777 1.0115 3.8983 0.9893 3.9531 0.9924 3.9703 1.0099 3.9220 3.9535 3.9394 1.0095 3.9318 0.9953 4.0555 3.9108 0.9915 3.8155 3.9365 3.9855 1.0047 3.9755 0.9917 3.9123 0.9903 3.9866 1.0150 1.5568 1.0348 2.0143 2.0807 4.1132 4.4754 1.1023 1.1565 1.1319 1.9840 1.9618 4.2375 4.4658 1.1074 1.1196 1.1335 1.8734 2.0450 4.2061 4.4375 1.0984 1.1475 1.1174 1.9182 2.0662 4.2213 4.4646 1.0969 1.1404 1.1040 1.7618 2.1179 4.2938 4.3421 1.0843 1.0891 1.1531 2.1197 1.0325 1.0815
dispersion: -0.212086782 hartree
energy: -8330.858232342116 hartree
dipole: 16.913103995 -12.181837620 4.731266375 13.715350051 -11.704314436 2.011035616 -38.546452740 30.267432543 -8.279020198
dipolemethod: SCF
magnitude: 9.745323042 au
magnitude: 24.770642617 debye
