program: Orca
programVersion: 6.0.1
elementType: Cu Ni Ni N N N N N C H C H C H C H C C C H C H C C H C C C H C H C H C H O H O O C C F F F O O C C F F F O O C C F F F O O C C F F F O O C C F F F O H H
charge: 0
multiplicity: 6
keywords: UKS b3lyp d3bj def2-TZVPP def2/J RIJCOSX VeryTightSCF defgrid3
formula: C26H14CuF15N5Ni2O12
InChI: InChI=1/C16H11N5.5C2F3O2.Cu.2Ni.H2O.HO/c1-3-8-17-12(5-1)14-7-10-21-11-15(20-16(21)19-14)13-6-2-4-9-18-13;5*3-2(4,5)1(6)7;;;;;/h1-11H;;;;;;;;;1H2;1H/q-4;4*-2;-1;2*+4;+5;;/rC26H14CuF15N5Ni2O12/c28-22(29,30)16(50)56-49-45-9-4-2-5-12(45)14-7-10-43-11-15-13-6-1-3-8-44(13)48(51,46(15)21(43)47(14)49)57-17(23(31,32)33)52-27(61(48)49,53-18(58-48)24(34,35)36,54-19(59-49)25(37,38)39)55-20(60-49)26(40,41)42/h1-11,61H,51H2
75 atoms
Cu 8.291344 5.186327 19.506777
Ni 9.536385 7.957003 18.029621
Ni 11.336769 4.831866 18.126455
N  8.943271 9.742702 17.192165
N  10.733586 8.020507 16.344566
N  11.92384 5.946662 16.546079
N  12.447093 7.282783 14.835526
N  12.760502 3.554165 17.290955
C  7.988201 10.546131 17.672717
H  7.516234 10.219808 18.591629
C  7.621206 11.730619 17.036597
H  6.840707 12.350292 17.462899
C  8.272496 12.088427 15.859922
H  8.012278 13.002018 15.336492
C  9.266823 11.254249 15.356442
H  9.780598 11.513263 14.439069
C  9.581485 10.082387 16.047947
C  10.603538 9.127181 15.598298
C  11.406458 9.345807 14.450425
H  11.304047 10.244833 13.859998
C  12.330064 8.413002 14.077005
H  12.9816 8.499234 13.217256
C  11.63816 7.107235 15.974667
C  13.249776 6.172871 14.71861
H  13.960595 6.065319 13.915309
C  12.907622 5.361142 15.781507
C  13.376553 4.044856 16.187267
C  14.362273 3.325601 15.509655
H  14.83528 3.747572 14.630065
C  14.717162 2.067106 15.984187
H  15.480167 1.487178 15.475902
C  14.078882 1.563833 17.117292
H  14.325423 0.586873 17.517061
C  13.106116 2.340378 17.741056
H  12.58032 1.999146 18.625436
O  10.054462 6.197455 18.862563
H  10.489735 6.532497 19.677447
O  11.046641 3.497824 19.695175
O  9.192242 4.062841 20.900988
C  10.276236 3.46396 20.680303
C  10.755807 2.508403 21.81611
F  10.845178 1.232995 21.356916
F  9.934665 2.498399 22.885602
F  11.990671 2.867857 22.251677
O  6.775578 5.924398 18.428086
O  8.001681 7.093575 16.903179
C  6.966174 6.56157 17.358227
C  5.713756 6.726194 16.445013
F  5.96579 6.252277 15.198407
F  5.390114 8.040241 16.32017
F  4.62432 6.08274 16.911979
O  8.293145 8.357363 19.675196
O  7.898837 6.500885 20.941851
C  7.952537 7.737789 20.70413
C  7.552416 8.658684 21.897268
F  6.668694 9.608616 21.504373
F  6.997286 7.986394 22.926353
F  8.65208 9.301217 22.374032
O  10.986989 9.044659 19.061017
O  11.578313 7.597569 20.715685
C  11.562957 8.703158 20.125921
C  12.359061 9.873865 20.786039
F  13.242018 10.423851 19.911391
F  13.059894 9.485952 21.87355
F  11.515513 10.865751 21.181229
O  9.928913 3.878659 16.934968
O  8.145071 3.597945 18.328903
C  8.845779 3.382457 17.301155
C  8.205044 2.33276 16.342592
F  9.032382 1.971863 15.340241
F  7.853324 1.206041 17.009062
F  7.076696 2.84016 15.778466
O  12.911289 5.629246 19.340528
H  13.174273 4.922051 19.952607
H  12.5305 6.336547 19.916487
totalener: -8330.64690685063579 hartree
kineticenergy: 8309.33381055354585 hartree
exchangeener: -487.690499097777 hartree
correlationener: -23.328463938159 hartree
xcener: -511.018963035936 hartree
s2: 8.761327
energy: -8791.6411 -8160.3982 -8160.3419 -1058.5085 -975.0138 -974.9584 -928.0778 -928.0400 -927.7214 -850.4170 -850.3941 -850.3647 -850.3552 -850.3486 -850.2876 -672.3486 -672.2978 -672.2320 -672.2250 -672.1380 -672.1325 -672.1288 -672.1156 -672.1063 -672.0835 -672.0534 -672.0117 -671.9974 -671.9581 -671.9153 -521.3529 -520.5599 -520.5524 -520.4911 -520.4787 -520.4699 -520.4116 -520.3340 -520.2674 -520.2362 -520.0023 -519.6396 -393.8652 -392.0142 -391.4078 -391.3490 -391.3179 -283.4431 -283.3511 -283.3279 -283.2041 -283.1886 -281.3459 -280.5932 -280.5451 -280.5053 -280.4379 -280.3661 -280.3565 -280.2898 -279.6787 -279.6690 -279.6383 -279.6311 -279.1733 -279.0704 -278.9594 -278.7006 -278.6435 -278.6260 -278.6038 -278.3665 -278.3390 -119.6814 -111.6761 -111.6088 -79.2460 -79.0712 -77.6560 -73.3545 -73.3301 -73.3228 -73.2477 -73.2342 -73.1415 -35.3991 -35.2945 -35.2792 -35.1647 -35.1276 -33.1293 -33.0245 -33.0225 -32.9973 -32.9199 -32.9109 -32.8910 -32.8520 -32.8043 -32.7532 -30.5497 -29.5740 -29.4479 -29.4000 -29.2839 -29.1549 -28.3299 -27.8991 -27.5202 -27.3663 -27.2760 -27.1886 -27.1241 -27.0330 -26.8923 -26.8351 -25.9303 -23.7109 -23.3561 -23.3109 -23.1286 -22.6649 -21.6667 -20.3587 -19.8494 -19.8301 -19.7339 -19.7038 -19.5715 -19.5511 -19.3987 -18.7194 -18.6225 -18.2271 -17.7151 -17.0666 -16.9458 -16.9365 -16.8818 -16.7822 -16.7309 -16.1359 -16.0852 -15.9542 -15.8499 -15.8310 -15.8123 -15.7833 -15.7392 -15.7175 -15.6705 -15.6344 -15.5914 -15.4507 -15.2879 -15.1606 -15.0103 -14.7434 -14.5348 -14.4134 -14.3702 -14.3381 -14.2398 -14.2184 -14.0871 -13.9934 -13.9765 -13.9410 -13.7544 -13.7077 -13.4974 -13.4023 -13.1827 -13.0979 -12.9599 -12.8631 -12.8292 -12.7658 -12.7425 -12.6676 -12.6406 -12.6077 -12.5597 -12.5532 -12.4693 -12.4546 -12.4330 -12.4131 -12.3545 -12.3349 -12.2930 -12.1747 -12.0994 -12.0583 -12.0157 -11.9393 -11.8856 -11.8345 -11.7557 -11.7223 -11.6555 -11.6240 -11.6053 -11.5340 -11.5085 -11.4852 -11.4758 -11.4480 -11.4131 -11.3934 -11.3645 -11.3263 -11.3171 -11.2459 -11.2115 -11.1570 -11.1003 -11.0206 -11.0031 -10.9618 -10.9189 -10.9008 -10.8161 -10.7467 -10.7383 -10.5237 -10.2955 -10.1879 -9.8486 -9.8077 -9.7476 -9.6492 -9.6198 -9.5789 -9.5557 -9.5192 -9.3997 -9.3373 -9.1205 -9.0803 -9.0404 -8.9389 -8.9244 -8.7938 -8.6460 -8.5834 -8.4909 -8.3860 -8.3241 -8.2232 -8.2048 -8.1350 -8.0696 -7.9820 -7.9188 -7.8203 -7.5807 -7.5121 -7.5059 -7.2615 -6.9684 -6.8555 -6.6142 -3.9531 -2.8165 -2.3689 -2.1102 -2.0050 -1.0092 -0.4286 -0.3833 -0.3012 -0.2108 -0.0727 electronvolt
energy: -8791.6303 -8160.3744 -8160.3181 -1057.9019 -973.7543 -973.6997 -927.5567 -927.4025 -927.3860 -849.3697 -849.3523 -849.3338 -849.3111 -849.3072 -849.2744 -672.3477 -672.2970 -672.2310 -672.2236 -672.1370 -672.1315 -672.1290 -672.1145 -672.1058 -672.0824 -672.0525 -672.0103 -671.9973 -671.9570 -671.9144 -521.3071 -520.5172 -520.4932 -520.4302 -520.4288 -520.4067 -520.3421 -520.2899 -520.2238 -520.1839 -520.0032 -519.5238 -393.8597 -391.9655 -391.3592 -391.2993 -391.2669 -283.4343 -283.3417 -283.3192 -283.1999 -283.1792 -281.3473 -280.5959 -280.5477 -280.5078 -280.4397 -280.3688 -280.3608 -280.2909 -279.6803 -279.6704 -279.6377 -279.6319 -279.1711 -279.0728 -278.9620 -278.7025 -278.6446 -278.6257 -278.6021 -278.3636 -278.3366 -118.4420 -108.9861 -108.9207 -77.4066 -77.3947 -77.2603 -70.4982 -70.4808 -70.4402 -70.4191 -70.4089 -70.3481 -35.3959 -35.2909 -35.2759 -35.1632 -35.1240 -33.1272 -33.0220 -33.0195 -32.9950 -32.9175 -32.9090 -32.8901 -32.8494 -32.8030 -32.7507 -30.5273 -29.4932 -29.3636 -29.3140 -29.1983 -29.1090 -28.2460 -27.8539 -27.4739 -27.2650 -27.1655 -27.0805 -27.0116 -26.9750 -26.8416 -26.7924 -25.6884 -23.6974 -23.3413 -23.2983 -23.1111 -22.6578 -21.6598 -20.3393 -19.8323 -19.7946 -19.6944 -19.6653 -19.5413 -19.5217 -19.3787 -18.7051 -18.6053 -18.2111 -17.6919 -17.0235 -16.9099 -16.8933 -16.8338 -16.7416 -16.6912 -16.1025 -16.0629 -15.9504 -15.8374 -15.8267 -15.7982 -15.7788 -15.7270 -15.7140 -15.6636 -15.6288 -15.5800 -15.4209 -15.2583 -15.1352 -14.9999 -14.7157 -14.4680 -14.3381 -14.2970 -14.2720 -14.1872 -14.1020 -14.0072 -13.9443 -13.9174 -13.8291 -13.6558 -13.2902 -13.2780 -13.1095 -13.0534 -13.0119 -12.8530 -12.8050 -12.7669 -12.6586 -12.6205 -12.5920 -12.5421 -12.5180 -12.4896 -12.4560 -12.4268 -12.4169 -12.4051 -12.3466 -12.3254 -12.2939 -12.2613 -12.1178 -12.0106 -11.9542 -11.8862 -11.7889 -11.7494 -11.6787 -11.6107 -11.5973 -11.5466 -11.5393 -11.4916 -11.4672 -11.4581 -11.4498 -11.4163 -11.4017 -11.3623 -11.3128 -11.2935 -11.2389 -11.1482 -11.1071 -11.0921 -11.0170 -10.9909 -10.9175 -10.8985 -10.8165 -10.7431 -10.7096 -10.2603 -10.0833 -9.9814 -9.7835 -9.7315 -9.7057 -9.4802 -9.4311 -9.4112 -9.3367 -9.0653 -8.9732 -8.8727 -8.7490 -8.6686 -8.6381 -8.5596 -8.4904 -8.3592 -8.3296 -8.2606 -8.2466 -8.1905 -8.0808 -8.0404 -8.0267 -7.9405 -7.8766 -7.8415 -7.8152 -7.7190 -7.6845 -7.5755 -7.5165 -7.4446 -6.6576 -3.9224 -2.8098 -2.7993 -2.3497 -2.0988 -1.9964 -1.5017 -1.4590 -1.3223 -1.0664 -1.0110 electronvolt
chargesum: -0.0000000
charge: 0.681491 1.081304 1.018821 -0.113411 -0.185554 -0.178097 -0.025942 -0.183277 0.007396 0.164388 -0.103035 0.159547 -0.104277 0.154825 -0.126835 0.128671 0.094030 0.166853 -0.124978 0.146207 -0.008152 0.161628 0.252295 -0.064506 0.177964 0.130274 0.069822 -0.125766 0.126819 -0.106529 0.154751 -0.113803 0.156570 -0.027606 0.171128 -0.949202 0.237650 -0.532483 -0.355501 0.319826 0.508827 -0.184392 -0.158864 -0.189724 -0.381857 -0.464474 0.321137 0.505726 -0.180225 -0.190165 -0.162758 -0.534029 -0.367906 0.345597 0.502356 -0.184754 -0.162682 -0.176429 -0.461748 -0.480077 0.285313 0.503788 -0.190588 -0.170786 -0.180166 -0.445921 -0.395013 0.315524 0.499515 -0.178325 -0.172088 -0.175798 -0.399600 0.216970 0.250310
charge: -0.048733 -0.133712 -0.141958 0.306060 0.304957 0.278002 0.351083 0.293031 -0.003478 0.030338 0.021502 0.031925 0.030087 0.030656 0.022696 0.021760 -0.106909 -0.081449 0.006531 0.029960 0.007328 0.032568 -0.222523 -0.030030 0.011163 -0.123864 -0.109960 0.020832 0.025607 0.028385 0.030442 0.008604 0.029631 -0.023478 0.029199 0.175424 -0.170101 0.155254 0.186332 -0.485885 -0.593853 0.173707 0.200101 0.171035 0.178981 0.159720 -0.490424 -0.594020 0.177675 0.169813 0.196872 0.169987 0.180653 -0.483700 -0.593042 0.174956 0.196342 0.178880 0.140202 0.078042 -0.537610 -0.596163 0.166637 0.187964 0.173821 0.171483 0.176622 -0.486252 -0.594725 0.185415 0.183265 0.179094 0.402623 -0.089488 -0.131890
qa: 0.6815 1.0813 1.0188 -0.1134 -0.1856 -0.1781 -0.0259 -0.1833 0.0074 0.1644 -0.1030 0.1595 -0.1043 0.1548 -0.1268 0.1287 0.0940 0.1669 -0.1250 0.1462 -0.0082 0.1616 0.2523 -0.0645 0.1780 0.1303 0.0698 -0.1258 0.1268 -0.1065 0.1548 -0.1138 0.1566 -0.0276 0.1711 -0.9492 0.2376 -0.5325 -0.3555 0.3198 0.5088 -0.1844 -0.1589 -0.1897 -0.3819 -0.4645 0.3211 0.5057 -0.1802 -0.1902 -0.1628 -0.5340 -0.3679 0.3456 0.5024 -0.1848 -0.1627 -0.1764 -0.4617 -0.4801 0.2853 0.5038 -0.1906 -0.1708 -0.1802 -0.4459 -0.3950 0.3155 0.4995 -0.1783 -0.1721 -0.1758 -0.3996 0.2170 0.2503
va: 2.5223 3.0318 3.1028 3.0591 2.9654 2.9060 3.5396 3.0445 3.9751 1.0142 3.9096 0.9899 3.9580 0.9925 3.9717 1.0104 3.9348 3.9615 3.9374 1.0102 3.9369 0.9963 4.0124 3.9098 0.9930 3.9937 3.9527 3.9681 1.0059 3.9538 0.9932 3.9117 0.9919 3.9810 1.0133 1.4223 1.0715 1.8889 2.0862 4.1622 4.4466 1.1108 1.1578 1.1057 2.0622 1.9772 4.1063 4.4796 1.1180 1.1028 1.1507 1.8961 2.0897 4.1081 4.4652 1.1100 1.1502 1.1201 1.9439 1.9767 4.1837 4.4636 1.1025 1.1382 1.1152 1.9869 2.0688 4.1402 4.4806 1.1242 1.1290 1.1250 2.0775 1.0307 1.0524
dispersion: -0.211729733 hartree
energy: -8330.858636583984 hartree
dipole: 43.138997191 -37.963628748 5.175368442 17.350175589 -15.307062490 2.043113099 -43.330691543 36.499883338 -6.830808205
dipolemethod: SCF
magnitude: 8.810147013 au
magnitude: 22.393614057 debye
