program: Orca
programVersion: 6.0.1
elementType: Cu Co Co N N N N N O H C H C H C H C H C C C H C C H C H C C C H C H C H C H C O O C F F F C O O C F F F C O O C F F F C O O C F F F C O O C F F F O H H
charge: 0
multiplicity: 8
keywords: UKS b3lyp d3bj def2-TZVPP def2/J RIJCOSX VeryTightSCF defgrid3
formula: C26H14Co2CuF15N5O12
InChI: InChI=1/C16H11N5.5C2F3O2.2Co.Cu.H2O.HO/c1-3-8-17-12(5-1)14-7-10-21-11-15(20-16(21)19-14)13-6-2-4-9-18-13;5*3-2(4,5)1(6)7;;;;;/h1-11H;;;;;;;;;1H2;1H/q-4;3*-2;2*-1;+4;+5;+3;;/rC26H14Co2CuF15N5O12/c30-22(31,32)16(50)53-27-46-8-3-1-5-12(46)14-7-10-45-11-15-13-6-2-4-9-47(13)29(49(15)21(45)48(14)27)60-20(26(42,43)44)59-28(52,61(27)29,54-17(51)23(33,34)35,57-18(55-27)24(36,37)38)58-19(56-27)25(39,40)41/h1-11,61H,52H2
75 atoms
Cu 3.009807 8.216098 4.87064
Co 0.138766 10.32572 5.176702
Co 1.065852 8.59008 2.279733
N  4.835775 7.600886 5.521667
N  3.225466 9.452654 6.433837
N  3.380841 10.946925 8.083516
N  1.410715 10.993742 6.719033
N  -0.924067 11.930592 6.014835
O  1.206395 8.737469 4.311689
H  0.63635 7.993253 4.662995
C  5.581501 6.649037 4.944601
H  5.140285 6.154036 4.088154
C  6.844357 6.313113 5.422161
H  7.416337 5.538003 4.925633
C  7.344951 6.985908 6.536484
H  8.324979 6.743294 6.933064
C  6.574979 7.977413 7.135457
H  6.934819 8.523366 8.000148
C  5.320346 8.266435 6.598682
C  4.423668 9.293108 7.097965
C  4.538284 10.204543 8.125446
H  5.311346 10.392027 8.852957
C  2.595657 10.460315 7.025625
C  2.934883 11.991446 8.844966
H  3.5773 12.323175 9.649978
C  1.7234 12.540075 8.538647
H  1.359567 13.366391 9.132602
C  0.967878 12.023542 7.455398
C  -0.337138 12.563908 7.05894
C  -0.943663 13.65095 7.692089
H  -0.461001 14.147437 8.524429
C  -2.181953 14.092467 7.235667
H  -2.669517 14.935302 7.713466
C  -2.779218 13.438304 6.161378
H  -3.742423 13.749722 5.773761
C  -2.115537 12.360777 5.579213
H  -2.535676 11.813593 4.74361
C  1.999485 5.92711 3.17776
O  2.752431 6.366629 4.086864
O  1.175292 6.513206 2.442282
C  2.166561 4.394948 2.938517
F  3.371133 4.143448 2.356556
F  2.129599 3.702166 4.102794
F  1.213336 3.885445 2.131364
C  3.987367 9.216119 2.231732
O  4.075799 9.552695 3.431409
O  3.046665 8.633922 1.630256
C  5.225667 9.581895 1.359436
F  6.367429 9.073218 1.89409
F  5.143015 9.130797 0.088222
F  5.380693 10.933295 1.298063
C  -1.765146 9.033767 3.08261
O  -1.009955 8.346596 2.357875
O  -1.489879 9.909514 3.938969
C  -3.294644 8.788535 2.913462
F  -3.926938 9.931695 2.536682
F  -3.582649 7.845587 1.991947
F  -3.84916 8.392143 4.089065
C  1.204813 11.601565 2.651721
O  1.056302 10.625029 1.883304
O  1.057942 11.693165 3.896525
C  1.649196 12.938037 1.982675
F  0.758565 13.930848 2.240756
F  2.852004 13.33803 2.474506
F  1.773226 12.844065 0.641952
C  -0.862272 7.765915 6.414987
O  -0.660248 9.002466 6.598364
O  -0.451267 7.019599 5.506975
C  -1.76701 7.13118 7.516388
F  -1.235391 7.314302 8.754897
F  -2.99994 7.707339 7.521178
F  -1.94641 5.802619 7.349923
O  0.642325 8.411968 0.165372
H  0.89778 9.239032 -0.276151
H  -0.324403 8.363939 0.073922
totalener: -8079.54596309729095 hartree
kineticenergy: 8058.57968682809951 hartree
exchangeener: -481.709537545221 hartree
correlationener: -23.164465398923 hartree
xcener: -504.874002944144 hartree
s2: 15.772979
energy: -8792.1700 -7552.4469 -7551.9038 -1059.0583 -928.6569 -928.5441 -928.2922 -894.7170 -894.1271 -776.2637 -776.0918 -775.7805 -775.7278 -775.3438 -775.3005 -672.1857 -672.1255 -672.1058 -672.1053 -672.0588 -672.0502 -671.9638 -671.9536 -671.9513 -671.9244 -671.9106 -671.8943 -671.8657 -671.7838 -671.7307 -521.0381 -520.4966 -520.3119 -520.2940 -520.1573 -520.1476 -520.0999 -520.0440 -519.9401 -519.8700 -519.8643 -519.5797 -393.9586 -391.9794 -391.6920 -391.5766 -391.3468 -283.3021 -283.1701 -283.1570 -283.1027 -282.9326 -281.4661 -280.5915 -280.4185 -280.3787 -280.3222 -280.2670 -280.0493 -279.8658 -279.8209 -279.8091 -279.7551 -279.6547 -279.2348 -279.1880 -278.9988 -278.7826 -278.6947 -278.6862 -278.6619 -278.4251 -278.3809 -120.1690 -103.8662 -103.3304 -79.8307 -79.3391 -78.2554 -68.4910 -68.1666 -68.0837 -67.5532 -67.3185 -67.2241 -35.2666 -35.1351 -35.0948 -35.0722 -34.9143 -32.9782 -32.9205 -32.8608 -32.8117 -32.8020 -32.7707 -32.7339 -32.7145 -32.6433 -32.5605 -30.6622 -29.3203 -29.2602 -29.1700 -28.9426 -28.7668 -28.0293 -27.9532 -27.6734 -27.1220 -27.0685 -27.0555 -26.9628 -26.9567 -26.6715 -26.5347 -26.1879 -23.7828 -23.4558 -23.3627 -23.2051 -22.7520 -21.7457 -20.4419 -19.9155 -19.6833 -19.5545 -19.5400 -19.5081 -19.4546 -19.2843 -18.8125 -18.6733 -18.2838 -17.8128 -17.0063 -16.8918 -16.7600 -16.7263 -16.6119 -16.4602 -16.2089 -16.1610 -15.7991 -15.7533 -15.6785 -15.6447 -15.6178 -15.6011 -15.5651 -15.5409 -15.5184 -15.4690 -15.3749 -15.2093 -15.0972 -14.9399 -14.8279 -14.4177 -14.3979 -14.3727 -14.2365 -14.1942 -14.0828 -13.9934 -13.9015 -13.7782 -13.6911 -13.5686 -13.4189 -13.3155 -13.2120 -13.1455 -13.0755 -13.0145 -12.8869 -12.7658 -12.6932 -12.6496 -12.5878 -12.4618 -12.4564 -12.4480 -12.3626 -12.3374 -12.3221 -12.2656 -12.2296 -12.2193 -12.1807 -12.1368 -12.0649 -11.9966 -11.9011 -11.8878 -11.8213 -11.7682 -11.7323 -11.6944 -11.6426 -11.5957 -11.5706 -11.5456 -11.4854 -11.4499 -11.4414 -11.3816 -11.3130 -11.2496 -11.2348 -11.2328 -11.1782 -11.1678 -11.0954 -11.0760 -11.0565 -10.9887 -10.9392 -10.9100 -10.7882 -10.7543 -10.7326 -10.7214 -10.6011 -10.5728 -10.3773 -10.2146 -10.1619 -10.0660 -10.0052 -9.7840 -9.7432 -9.6336 -9.5704 -9.4457 -9.3753 -9.2847 -9.2265 -9.0847 -8.9390 -8.8439 -8.7136 -8.6544 -8.6398 -8.5236 -8.4137 -8.2798 -8.1786 -8.0035 -7.9319 -7.8936 -7.8268 -7.7057 -7.6761 -7.6572 -7.6191 -7.4685 -7.4438 -7.1557 -6.9117 -6.7579 -6.4368 -6.3843 -4.0036 -2.9052 -2.4844 -2.1608 -2.0620 -1.0740 -0.3545 -0.2288 -0.1501 -0.0340 0.0097 electronvolt
energy: -8792.1594 -7552.4144 -7551.8716 -1058.4748 -928.1189 -927.9896 -927.9472 -892.9436 -892.3569 -774.6750 -774.6053 -774.4581 -774.1142 -773.9427 -773.9259 -672.1854 -672.1245 -672.1054 -672.1044 -672.0582 -672.0501 -671.9629 -671.9528 -671.9508 -671.9236 -671.9106 -671.8944 -671.8639 -671.7836 -671.7296 -521.0022 -520.4321 -520.2697 -520.2491 -520.1104 -520.1063 -520.0584 -519.8988 -519.8658 -519.8536 -519.8132 -519.5753 -393.9534 -391.9379 -391.6319 -391.5265 -391.3041 -283.2957 -283.1631 -283.1482 -283.0993 -282.9292 -281.4676 -280.5963 -280.4171 -280.3855 -280.3246 -280.2679 -280.0503 -279.8665 -279.8223 -279.8102 -279.7544 -279.6551 -279.2318 -279.1897 -279.0007 -278.7843 -278.6929 -278.6874 -278.6618 -278.4217 -278.3794 -118.9846 -99.8506 -99.3094 -77.9350 -77.9132 -77.8403 -63.8778 -63.8522 -63.7681 -63.3583 -63.2758 -63.2581 -35.2642 -35.1327 -35.0914 -35.0712 -34.9129 -32.9767 -32.9184 -32.8594 -32.8100 -32.8016 -32.7688 -32.7307 -32.7135 -32.6428 -32.5588 -30.6416 -29.2514 -29.1735 -29.1015 -28.9067 -28.7186 -27.9641 -27.9120 -27.6233 -27.0382 -27.0081 -26.9663 -26.9123 -26.8732 -26.6240 -26.4483 -25.8124 -23.7727 -23.4363 -23.3519 -23.1885 -22.7453 -21.7389 -20.4260 -19.9019 -19.6546 -19.5233 -19.5092 -19.4833 -19.4406 -19.2672 -18.7951 -18.6571 -18.2683 -17.7866 -16.9819 -16.8513 -16.7164 -16.6826 -16.5909 -16.4333 -16.1860 -16.1308 -15.7959 -15.7428 -15.6738 -15.6408 -15.6164 -15.5922 -15.5505 -15.5350 -15.4856 -15.4670 -15.3694 -15.1861 -15.0902 -14.9048 -14.8007 -14.3933 -14.3288 -14.2919 -14.1831 -14.0824 -14.0589 -13.9402 -13.8360 -13.7074 -13.5478 -13.4310 -13.1986 -13.1645 -13.0253 -12.9934 -12.9395 -12.7877 -12.7044 -12.6018 -12.5860 -12.5627 -12.4701 -12.4435 -12.4152 -12.3966 -12.3502 -12.3054 -12.2875 -12.2441 -12.2107 -12.1404 -12.0964 -11.9476 -11.8765 -11.8374 -11.7903 -11.7047 -11.6761 -11.6287 -11.5789 -11.5557 -11.5365 -11.5311 -11.4947 -11.4467 -11.4400 -11.4158 -11.3353 -11.2803 -11.2281 -11.2228 -11.2139 -11.1325 -11.0710 -11.0617 -11.0026 -10.9266 -10.9073 -10.8128 -10.7711 -10.7313 -10.7201 -10.6623 -10.5795 -10.5646 -10.3676 -9.9754 -9.7965 -9.7482 -9.6125 -9.5037 -9.3819 -9.3772 -9.3551 -9.1836 -9.1108 -8.7360 -8.6547 -8.5787 -8.4511 -8.2911 -8.2470 -8.2257 -8.1498 -8.0470 -7.9685 -7.9193 -7.7725 -7.7368 -7.7038 -7.6786 -7.6121 -7.3183 -7.2504 -6.7529 -6.6393 -6.2425 -6.0673 -3.9704 -3.2621 -2.9007 -2.4767 -2.3231 -2.1117 -1.7013 -1.3321 -1.0698 -0.6610 -0.3960 electronvolt
chargesum: -0.0000000
charge: 0.511970 1.075747 1.132852 -0.056404 -0.157977 -0.025027 -0.145734 -0.149078 -0.895468 0.294476 0.012349 0.155777 -0.103743 0.159294 -0.108069 0.155888 -0.124960 0.129458 0.062472 0.189420 -0.061549 0.179399 0.240356 -0.007856 0.162265 -0.122761 0.146781 0.172689 0.111587 -0.128079 0.128776 -0.100768 0.155337 -0.114939 0.159218 0.003754 0.167550 0.329175 -0.500583 -0.395689 0.499662 -0.190481 -0.176400 -0.162046 0.316463 -0.476976 -0.444937 0.502089 -0.192443 -0.169953 -0.181151 0.308312 -0.435722 -0.547684 0.497109 -0.191034 -0.168258 -0.177011 0.308073 -0.450236 -0.480856 0.496457 -0.187158 -0.181636 -0.174393 0.266411 -0.500198 -0.419676 0.502356 -0.194559 -0.185215 -0.168851 -0.317150 0.223133 0.216054
charge: -0.053155 -0.082901 -0.068577 0.292844 0.265964 0.352655 0.302986 0.298108 0.181657 -0.168218 0.000197 0.036878 0.017232 0.032031 0.034063 0.031820 0.023834 0.026575 -0.105622 -0.123267 -0.025618 0.012725 -0.220222 0.008335 0.032597 0.009154 0.030474 -0.081234 -0.106923 0.022668 0.021811 0.030038 0.030681 0.019823 0.031564 -0.003807 0.031598 -0.477839 0.152129 0.184824 -0.591712 0.166984 0.180241 0.197391 -0.522391 0.116391 0.152337 -0.590304 0.165819 0.187271 0.171381 -0.498719 0.160295 0.149991 -0.593455 0.167045 0.191661 0.179120 -0.491048 0.160984 0.141585 -0.593981 0.170884 0.174916 0.188918 -0.539665 0.105434 0.105412 -0.594071 0.162700 0.169487 0.188920 0.425463 -0.080640 -0.082527
qa: 0.5120 1.0757 1.1329 -0.0564 -0.1580 -0.0250 -0.1457 -0.1491 -0.8955 0.2945 0.0123 0.1558 -0.1037 0.1593 -0.1081 0.1559 -0.1250 0.1295 0.0625 0.1894 -0.0615 0.1794 0.2404 -0.0079 0.1623 -0.1228 0.1468 0.1727 0.1116 -0.1281 0.1288 -0.1008 0.1553 -0.1149 0.1592 0.0038 0.1676 0.3292 -0.5006 -0.3957 0.4997 -0.1905 -0.1764 -0.1620 0.3165 -0.4770 -0.4449 0.5021 -0.1924 -0.1700 -0.1812 0.3083 -0.4357 -0.5477 0.4971 -0.1910 -0.1683 -0.1770 0.3081 -0.4502 -0.4809 0.4965 -0.1872 -0.1816 -0.1744 0.2664 -0.5002 -0.4197 0.5024 -0.1946 -0.1852 -0.1689 -0.3172 0.2231 0.2161
va: 2.5047 4.1483 4.1115 3.1857 3.0891 3.5357 2.9948 3.0558 1.5400 1.0183 3.9919 1.0200 3.9149 0.9910 3.9702 0.9924 3.9609 1.0056 3.9471 3.9085 3.9104 0.9930 4.0609 3.9330 0.9962 3.9410 1.0099 3.9549 3.9115 3.9739 1.0107 3.9540 0.9924 3.9115 0.9903 3.9918 1.0129 4.1740 1.9703 2.0456 4.4654 1.1012 1.1245 1.1520 4.1112 1.9408 1.9901 4.4857 1.0986 1.1372 1.1144 4.2159 1.9947 1.8797 4.4552 1.1000 1.1422 1.1224 4.2051 1.9642 1.9548 4.4808 1.1109 1.1150 1.1345 4.2140 1.9038 2.0668 4.4691 1.0947 1.1075 1.1406 2.1404 1.0240 1.0315
dispersion: -0.208959357 hartree
energy: -8079.754922454044 hartree
dipole: 17.022571583 -13.617266689 3.405304894 25.033758679 -20.583061830 4.450696849 38.602327877 -32.403322524 6.199005353
dipolemethod: SCF
magnitude: 8.356582509 au
magnitude: 21.240744708 debye
