program: Orca
programVersion: 6.0.1
elementType: Cu Cu O H N C H C H C H C H C C C H N C N C H C H C N C C H C H C H C H N O O C C F F F O O C C F F F O O C C F F F
charge: 0
multiplicity: 3
keywords: UKS b3lyp d3bj def2-TZVPP def2/J RIJCOSX VeryTightSCF defgrid3
formula: C22H12Cu2F9N5O7
InChI: InChI=1/C16H11N5.3C2F3O2.2Cu.HO/c1-3-8-17-12(5-1)14-7-10-21-11-15(20-16(21)19-14)13-6-2-4-9-18-13;3*3-2(4,5)1(6)7;;;/h1-11H;;;;;;1H/q-4;;2*-1;2*+3;/rC20H12Cu2F6N5O5.C2F3O2/c23-19(24,25)16(34)36-21-30-8-3-1-5-12(30)14-7-10-29-11-15-13-6-2-4-9-31(13)22(38-21,33(15)18(29)32(14)21)37-17(35)20(26,27)28;3-2(4,5)1(6)7/h1-11,38H;
57 atoms
Cu 9.348771 8.734478 10.834682
Cu 9.423661 8.694905 7.492223
O  8.440075 9.029582 9.134678
H  8.239253 9.994611 9.16557
N  9.761393 7.898436 12.677289
C  9.687106 8.533606 13.854371
H  9.407829 9.579682 13.807723
C  9.949396 7.889025 15.060599
H  9.878919 8.442138 15.989969
C  10.297648 6.539441 15.04345
H  10.505504 6.011028 15.967618
C  10.377693 5.873469 13.823864
H  10.647205 4.82459 13.771256
C  10.105026 6.582255 12.655522
C  10.17139 6.032333 11.311543
C  10.546349 4.812011 10.783387
H  10.866916 3.887572 11.235731
N  10.464582 4.965452 9.414194
C  10.037393 6.276941 9.162623
N  9.848515 6.909444 10.304853
C  10.739289 4.134177 8.362197
H  11.046384 3.123866 8.599034
C  10.632304 4.63512 7.093612
H  10.866477 3.993113 6.256021
C  10.242736 5.983501 6.895656
N  9.920138 6.768234 7.930844
C  10.21687 6.66081 5.596164
C  10.503294 6.033528 4.384825
H  10.725032 4.973781 4.353633
C  10.505566 6.791544 3.216582
H  10.723974 6.322435 2.263588
C  10.232245 8.153752 3.293683
H  10.234872 8.78342 2.411694
C  9.948349 8.714361 4.537454
H  9.730733 9.769415 4.649479
N  9.931888 7.987324 5.660558
O  8.721239 10.391803 11.712865
O  7.992424 11.622273 9.9392
C  8.258134 11.426818 11.131068
C  8.01111 12.590836 12.143719
F  7.143557 12.216548 13.12189
F  9.168427 12.960872 12.755105
F  7.499385 13.691244 11.552248
O  8.74786 10.425731 6.759034
O  6.779076 9.432876 6.199961
C  7.555933 10.383444 6.290177
C  7.105341 11.777199 5.744723
F  7.241399 12.756606 6.675973
F  5.814712 11.781592 5.344999
F  7.859672 12.140634 4.669212
O  11.421821 9.484697 8.06703
O  11.357632 9.627376 10.34637
C  11.869025 9.746621 9.208016
C  13.323493 10.327669 9.248055
F  14.145675 9.539378 9.996745
F  13.897761 10.445801 8.027262
F  13.340782 11.566447 9.815405
totalener: -5825.45986639488092 hartree
nucrepener: 8009.88499857601073 hartree
kineticenergy: 5810.35427964416522 hartree
exchangeener: -343.407303339423 hartree
correlationener: -16.602677605190 hartree
xcener: -360.009980944614 hartree
s2: 2.006543
energy: -8791.5805 -8791.5521 -1058.4935 -1058.4440 -928.0388 -928.0363 -928.0140 -927.9603 -927.7203 -927.6775 -671.6175 -671.6095 -671.5519 -671.5321 -671.5041 -671.4398 -671.4316 -671.3305 -671.1953 -519.8495 -519.6252 -519.3465 -519.3328 -519.2321 -519.1313 -518.9425 -394.1134 -392.2667 -391.7252 -391.5633 -391.5613 -282.6613 -282.6087 -282.4848 -281.5392 -280.8026 -280.6005 -279.8997 -279.8968 -279.8761 -279.7894 -279.5342 -279.5137 -279.4400 -279.2917 -279.2243 -279.0717 -278.8799 -278.8645 -278.7574 -278.6850 -278.5530 -278.3929 -119.6021 -119.5487 -79.0798 -79.0521 -79.0121 -78.8664 -77.6599 -77.6187 -34.6545 -34.6105 -34.4592 -32.3802 -32.3587 -32.3018 -32.2443 -32.2279 -32.0464 -30.8300 -28.4676 -28.2835 -28.2436 -28.1997 -27.6790 -27.3027 -27.0273 -26.2240 -26.0557 -25.9919 -25.3520 -23.9397 -23.5598 -23.4466 -23.3042 -22.8265 -21.8791 -20.5722 -20.1026 -19.5918 -19.0052 -18.9164 -18.9036 -18.8126 -18.7698 -18.3947 -17.8896 -17.1554 -16.3565 -16.2846 -16.1882 -16.0753 -15.9791 -15.5428 -15.3694 -15.2573 -15.2063 -15.1566 -15.1132 -15.0817 -15.0219 -14.8906 -14.8821 -14.5317 -14.4258 -14.3170 -14.1398 -14.0835 -13.6811 -13.3147 -13.2344 -13.2072 -13.1363 -13.0818 -13.0112 -12.8804 -12.7909 -12.5606 -12.2284 -12.1564 -12.1118 -11.9894 -11.9430 -11.9182 -11.8825 -11.8013 -11.7946 -11.7557 -11.7055 -11.6447 -11.5896 -11.5526 -11.4891 -11.3257 -11.2860 -11.1675 -11.0708 -11.0062 -10.9145 -10.8370 -10.8169 -10.8091 -10.6920 -10.6191 -10.5900 -10.4349 -10.4024 -10.3116 -10.3007 -10.2007 -10.1046 -10.0046 -9.9250 -9.8443 -9.6792 -9.6034 -9.5034 -9.4526 -9.3228 -9.2239 -8.9610 -8.8767 -8.8200 -8.6481 -8.5747 -8.3134 -7.9979 -7.7688 -7.3722 -7.2318 -7.1558 -6.9422 -6.8706 -6.7914 -6.6153 -6.5369 -6.3900 -4.2088 -3.0118 -2.5533 -2.3423 -2.1027 -1.2169 -0.4562 -0.0483 0.0229 0.1875 0.2624 electronvolt
energy: -8791.5701 -8791.5418 -1057.9110 -1057.8699 -927.5577 -927.5141 -927.4024 -927.3998 -927.3677 -927.3551 -671.6175 -671.6095 -671.5518 -671.5322 -671.5041 -671.4377 -671.4316 -671.3282 -671.1952 -519.7728 -519.5309 -519.3461 -519.2332 -519.1317 -519.1215 -518.9420 -394.1086 -392.2221 -391.6739 -391.5134 -391.5061 -282.6550 -282.6088 -282.4766 -281.5409 -280.8046 -280.6038 -279.9004 -279.8970 -279.8756 -279.7903 -279.5366 -279.5141 -279.4382 -279.2955 -279.2269 -279.0736 -278.8804 -278.8646 -278.7589 -278.6836 -278.5507 -278.3901 -118.4239 -118.3866 -77.3896 -77.3499 -77.3451 -77.3189 -77.2708 -77.2281 -34.6521 -34.6105 -34.4562 -32.3798 -32.3587 -32.2986 -32.2443 -32.2255 -32.0445 -30.8068 -28.3915 -28.2536 -28.1974 -28.1419 -27.6360 -27.2518 -26.9805 -26.1477 -26.0537 -25.8932 -24.8681 -23.9259 -23.5480 -23.4288 -23.2873 -22.8178 -21.8714 -20.5526 -20.0874 -19.5724 -18.9768 -18.9154 -18.8864 -18.7815 -18.7525 -18.3778 -17.8644 -17.1301 -16.3240 -16.2592 -16.1486 -16.0732 -15.9330 -15.5166 -15.3419 -15.2481 -15.2038 -15.1566 -15.1035 -15.0816 -15.0161 -14.8832 -14.8573 -14.5185 -14.3920 -14.2464 -14.1154 -14.0627 -13.5818 -13.2921 -13.1976 -13.1653 -13.0452 -12.9706 -12.8178 -12.7635 -12.5895 -12.3143 -12.1307 -11.9819 -11.9377 -11.9167 -11.9056 -11.8164 -11.7997 -11.7314 -11.7277 -11.6943 -11.6471 -11.5188 -11.4516 -11.4383 -11.2858 -11.1979 -11.1069 -11.0785 -10.9016 -10.8343 -10.8130 -10.7767 -10.6661 -10.6028 -10.5602 -10.4270 -10.3812 -10.3084 -10.3011 -10.2734 -10.1455 -10.1007 -9.9249 -9.8242 -9.6512 -9.5377 -9.4177 -9.3036 -9.2609 -8.9388 -8.8970 -8.8470 -8.8031 -8.4727 -8.3794 -8.0711 -7.8088 -7.7640 -7.6211 -7.5528 -7.2870 -7.1930 -7.0691 -6.7865 -6.7110 -6.5074 -6.3031 -4.1831 -3.0067 -2.7642 -2.5472 -2.4749 -2.3126 -2.0987 -1.2167 -0.4538 -0.0455 0.0293 electronvolt
chargesum: 0.0000000
charge: 0.449135 0.512900 -0.599076 0.265579 -0.141152 -0.009335 0.184197 -0.102779 0.158478 -0.102187 0.155609 -0.133785 0.129032 0.022633 0.226951 -0.066565 0.182472 -0.032836 0.220244 -0.042846 -0.002862 0.164146 -0.127866 0.148067 0.190589 -0.047456 0.111961 -0.128332 0.131784 -0.101281 0.158073 -0.097777 0.163129 0.000048 0.179549 -0.070958 -0.465212 -0.378361 0.268653 0.512112 -0.196481 -0.190705 -0.167380 -0.462057 -0.389516 0.245508 0.505252 -0.166087 -0.174262 -0.200698 -0.460773 -0.467412 0.295101 0.509615 -0.199166 -0.183634 -0.181981
charge: -0.071597 -0.092405 0.136598 -0.159917 0.289809 0.001528 0.037832 0.014803 0.031366 0.031050 0.030994 0.019842 0.025897 -0.109702 -0.119394 -0.025305 0.011849 0.352602 -0.218938 0.280269 0.011842 0.033236 0.008304 0.031200 -0.082801 0.306905 -0.104004 0.024368 0.023837 0.034774 0.032140 0.027395 0.034325 0.013904 0.042131 0.300381 0.118562 0.106909 -0.522802 -0.593308 0.163334 0.167541 0.191904 0.122416 0.070509 -0.557686 -0.594355 0.182368 0.184123 0.155519 0.111087 0.106996 -0.532151 -0.584182 0.155751 0.173918 0.168429
qa: 0.4491 0.5129 -0.5991 0.2656 -0.1412 -0.0093 0.1842 -0.1028 0.1585 -0.1022 0.1556 -0.1338 0.1290 0.0226 0.2270 -0.0666 0.1825 -0.0328 0.2202 -0.0428 -0.0029 0.1641 -0.1279 0.1481 0.1906 -0.0475 0.1120 -0.1283 0.1318 -0.1013 0.1581 -0.0978 0.1631 0.0000 0.1795 -0.0710 -0.4652 -0.3784 0.2687 0.5121 -0.1965 -0.1907 -0.1674 -0.4621 -0.3895 0.2455 0.5053 -0.1661 -0.1743 -0.2007 -0.4608 -0.4674 0.2951 0.5096 -0.1992 -0.1836 -0.1820
va: 2.5788 2.5304 1.9975 1.0461 3.1871 3.9829 1.0087 3.8934 0.9910 3.9462 0.9925 3.9770 1.0053 4.0460 3.7888 3.9181 0.9919 3.5408 4.0905 3.1303 3.9310 0.9952 3.9401 1.0095 3.8981 3.1643 3.9162 3.9720 1.0094 3.9525 0.9915 3.9002 0.9894 4.0088 1.0035 3.2203 1.9931 2.1080 4.2574 4.4188 1.0929 1.1005 1.1469 1.9829 2.0943 4.2056 4.4608 1.1335 1.1319 1.0824 1.9451 1.9436 4.1939 4.4504 1.0879 1.1170 1.1133
dispersion: -0.151358127 hartree
energy: -5825.611224521514 hartree
dipole: 10.141081240 -7.527615317 2.613465923 -47.147562153 37.307431707 -9.840130446 -1.665636736 1.960776907 0.295140171
dipolemethod: SCF
magnitude: 10.185552466 au
magnitude: 25.889616888 debye
