program: Gaussian 09
title: 000061032
version: EM64L-G09RevD.01
frameworkgroup: C1[X(C4H7NO)]
method: RPBEPBE
basis: SDD
operation: Freq
keyword: #pfreq=noraman
keyword: PBEPBE/SDD
title: #p freq=noraman PBEPBE/SDD
converged: YES YES NO YES
title: Mulliken charges:
elementType: O N C C C C H H H H H H H
charge: -0.270799 -0.021064 -0.229408 -0.430637 -0.496193 -0.116129 0.203215 0.204526 0.266408 0.237600 0.209142 0.202525 0.240814
chargesum: 0.00000
title: Mulliken charges with hydrogens summed into heavy atoms:
elementType: O N C C C C
charge: -0.270799 -0.021064 0.178333 0.073371 0.156287 -0.116129
polarizability: 5.82074538e+01 5.05143698e+00 5.14739248e+01 -1.02081891e+00 -7.32308332e-01 3.83344583e+01
1716.lowfreq: -9.2240 -0.0014 -0.0009 -0.0008 5.8607 15.3584 67.4301 93.9659 194.9532
frequency: 67.4148 93.9572 194.9521 225.3329 269.0579 366.1446 395.7040 577.5863 789.6541 832.0789 961.0128 1026.6691 1054.5037 1089.9866 1117.5144 1151.9360 1193.1889 1246.7445 1329.5991 1372.1371 1432.0514 1438.7671 1459.9858 1467.1630 1486.9780 2206.4074 2925.8978 2935.4709 2982.2589 3008.4932 3011.2910 3069.0979 3112.7421
redmass: 3.8318 2.5429 2.1548 1.5225 2.6042 3.7401 3.5830 3.4017 2.8378 2.8161 3.0056 2.2912 2.1864 3.9395 1.3247 1.3606 1.1241 1.2051 1.4275 1.2813 1.0900 1.1455 1.0509 1.0588 1.0751 12.4369 1.0476 1.0424 1.1035 1.1019 1.0631 1.1005 1.0974
irintensity: 3.7175 6.3434 3.1796 3.3139 7.8739 0.3570 0.9741 5.3946 7.8348 0.5479 14.1160 10.9149 28.2811 74.4728 3.9548 9.3902 5.7780 3.8589 4.4828 15.0496 19.0535 0.1846 13.3729 14.3449 4.8401 8.7918 47.8123 101.4090 53.6161 71.7007 11.2226 6.6375 24.5837
temp: 298.150 k
press: 1.00000 atm
elementType: 8 7 6 6 6 6 1 1 1 1 1 1 1
symmnumber: 1
zpe: 274493.8 jmol-1
zpe.correction: 0.104549 hartree
zpe.thermalcorrener: 0.111714 hartree
zpe.thermalcorrenthalpy: 0.112658 hartree
zpe.thermalcorrgfe: 0.073052 hartree
zpe.sumelectzpe: -286.077632 hartree
zpe.sumelectthermal: -286.070467 hartree
zpe.sumelectthermalent: -286.069523 hartree
zpe.sumelectthermalfe: -286.109129 hartree
dipole: 3.4964 3.5166 0.9715
dipole: 5.0532
quadrupole: -40.0653 -36.1070 -36.0217
quadrupole: -7.5394 2.3345 0.0176
quadrupole: -2.6673 1.2910 1.3763 -7.5394 2.3345 0.0176
hfenergy: -286.182181 hartree
pointgroup: C01 [X(C4H7N1O1)]
dipole: -1.4383339 1.3417191 -0.2889168 debye
dipolederiv: -0.8894624 -0.2420155 0.0110793 -0.338804 -0.6095765 -0.0207623 0.0556872 0.039064 -0.4261847 -0.3029152 0.0103383 -0.0027549 0.0656796 -0.2324527 0.0063166 0.0343043 -0.006005 -0.2376842 0.5546469 0.0957193 -0.1024211 0.229853 0.5581702 -0.0511002 -0.1751375 -0.133623 0.4020678 -0.0124508 0.0266539 -0.0123919 0.0237377 0.1027729 -0.0399178 -0.0326842 -0.0451828 0.1801936 0.6676336 0.1148864 0.0314284 0.0759797 0.3420901 0.0827456 0.1503556 0.1288703 0.3048415 0.0754169 -0.1031725 -0.0471618 -0.1477458 0.0438687 0.0239714 -0.0888701 0.0267412 -0.0529196 0.0238238 -0.0333884 0.0093915 -0.0505131 0.006454 -0.0789853 0.0514086 0.0146625 -0.1977587 -0.090829 0.1434989 0.0079418 0.0381365 -0.1951466 0.0284434 0.0458471 0.0039567 0.0475426 0.0903637 0.0467594 0.0114264 0.0592 0.0960079 -0.0009959 -0.0111008 -0.0426838 -0.0406791 0.0137467 -0.0417855 0.0329645 -0.0245104 -0.0350704 0.0448029 0.0422596 0.08202 0.0986016 -0.0110269 -0.0133627 0.0492659 -0.0138566 0.0443632 -0.0752198 -0.0677166 -0.1416863 -0.1781738 -0.1468517 0.063034 -0.0128987 0.1850119 -0.0999376 -0.0132916 -0.0553038 -0.0340577 0.07259 0.0279044 -0.0671657 0.0241305 -0.1021685 -0.0215432 0.093993 0.0509508 0.1079238 0.0275629 unknown
polarizability: 58.5871917|-4.6582556|50.9398188|-1.6023938|1.4398056|38.4888264 unknown
InChI: InChI=1S/C4H7NO/c1-6-4-2-3-5/h2,4H2,1H3
charge 0 multiplicity 1
13 atoms
O  -1.326651 -0.223442 0.430017
N  2.370823 -0.920724 -0.244882
C  -0.720935 0.846121 -0.355539
C  0.683471 1.087849 0.230549
C  -2.624543 -0.64376 -0.097319
C  1.612674 -0.026272 -0.026175
H  -0.655737 0.564563 -1.429007
H  -1.316905 1.782119 -0.27148
H  0.588644 1.23492 1.322166
H  1.111049 2.014224 -0.19753
H  -2.533602 -1.031872 -1.133571
H  -3.359943 0.188963 -0.086322
H  -2.975243 -1.449787 0.565092
