program: Orca
programVersion: 6.0.1
elementType: Cu Ni Cu Ni N C H C H C H C H C C C H N C N C H C H C N C C H C H C H C H N N C H C H C H C H C C C H N C N C H C H C N C C H C H C H C H N O O O O O O C O O C O O C O O C O O C O O C H H H H H H C F F F C F F F C F F F C F F F C F F F C F F F
charge: 0
multiplicity: 7
keywords: UKS b3lyp d3bj def2-TZVPP def2/J RIJCOSX VeryTightSCF defgrid3
formula: C44H28Cu2F18N10Ni2O16
InChI: InChI=1/2C16H11N5.6C2F3O2.2Cu.2Ni.2H2O.2HO/c2*1-3-8-17-12(5-1)14-7-10-21-11-15(20-16(21)19-14)13-6-2-4-9-18-13;6*3-2(4,5)1(6)7;;;;;;;;/h2*1-11H;;;;;;;;;;;2*1H2;2*1H/q2*-4;;;;-2;2*-1;4*+3;;;;/rC38H28Cu2F9N10Ni2O10.3C2F3O2/c41-36(42,43)31(62)66-39-52-15-5-1-9-23(52)27-13-19-50-21-29-25-11-3-7-17-54(25)60(64,58(29)34(50)56(27)39)68-33(38(47,48)49)69-61(65,70(39)60)55-18-8-4-12-26(55)30-22-51-20-14-28-24-10-2-6-16-53(24)40(71(60)61,57(28)35(51)59(30)61)67-32(63)37(44,45)46;3*3-2(4,5)1(6)7/h1-22,70-71H,64-65H2;;;
120 atoms
Cu 5.615683 7.218267 9.25975
Ni 4.906931 4.84663 6.69725
Cu 6.276957 6.687079 4.073598
Ni 7.816947 5.639444 7.097756
N  3.75317 4.296578 5.059533
C  3.734065 3.091451 4.477302
H  4.372645 2.33918 4.926049
C  2.954036 2.819382 3.356561
H  2.974424 1.829823 2.914888
C  2.167678 3.837703 2.81958
H  1.556601 3.658649 1.941514
C  2.174389 5.089727 3.424749
H  1.573033 5.904509 3.038233
C  2.973392 5.282873 4.550341
C  3.068646 6.538271 5.277381
C  2.472027 7.770911 5.101423
H  1.758907 8.141697 4.383515
N  2.995782 8.57435 6.088036
C  3.892185 7.791281 6.838384
N  3.934162 6.567262 6.346728
C  2.809299 9.89068 6.401958
H  2.106531 10.447176 5.795908
C  3.521913 10.413595 7.444145
H  3.386712 11.454571 7.702049
C  4.412359 9.590478 8.175082
N  4.579893 8.295565 7.867092
C  5.226348 10.06678 9.296418
C  5.351159 11.408426 9.653877
H  4.814327 12.175934 9.110778
C  6.192686 11.747898 10.71024
H  6.310989 12.786659 10.998499
C  6.876998 10.740498 11.384003
H  7.541395 10.96209 12.210977
C  6.697803 9.419192 10.979912
H  7.195032 8.59202 11.471655
N  5.89871 9.094218 9.958424
N  9.051793 6.099678 8.706163
C  9.596966 5.222531 9.559171
H  9.384821 4.17829 9.361574
C  10.375755 5.6229 10.641498
H  10.789442 4.87754 11.310727
C  10.59844 6.983986 10.844182
H  11.194354 7.327368 11.682848
C  10.046351 7.901221 9.955871
H  10.199989 8.966916 10.081701
C  9.278748 7.42537 8.893528
C  8.641427 8.274204 7.898904
C  8.612996 9.642129 7.710114
H  9.052724 10.464572 8.250575
N  7.822524 9.841223 6.601588
C  7.404334 8.576439 6.149816
N  7.891469 7.636929 6.937609
C  7.409322 10.970739 5.954067
H  7.755462 11.918002 6.346324
C  6.592989 10.830322 4.867122
H  6.259858 11.713244 4.340247
C  6.217085 9.53855 4.429232
N  6.62707 8.434083 5.072042
C  5.376146 9.290021 3.256862
C  4.682611 10.285288 2.571279
H  4.755422 11.32027 2.881412
C  3.877923 9.923037 1.493777
H  3.321393 10.68007 0.952296
C  3.7967 8.582929 1.12752
H  3.182102 8.259259 0.295793
C  4.524551 7.640829 1.851587
H  4.506852 6.585575 1.608791
N  5.289426 7.98723 2.892566
O  6.044137 5.625655 8.200437
O  6.554242 5.406987 5.522788
O  3.449482 4.129209 7.983692
O  9.463442 5.387781 5.810634
O  6.556257 6.493775 10.86765
O  6.551503 4.254347 10.458322
C  6.719576 5.265737 11.154761
O  5.924413 5.242688 2.74567
O  7.051195 3.503645 3.686131
C  6.428353 4.075691 2.779589
O  7.946936 3.604571 7.396536
O  5.808862 2.98633 6.893862
C  7.007104 2.791548 7.20367
O  3.701486 7.132101 10.404581
O  3.190124 4.917057 10.528995
C  3.142412 6.11363 10.881785
O  9.957465 7.590853 4.437461
O  8.276889 7.020983 3.015663
C  9.255183 7.699791 3.401797
O  -0.63515 5.540283 5.868199
O  1.027562 4.375328 6.880414
C  0.166908 5.292471 6.785092
H  6.185645 4.957136 8.920097
H  6.827128 4.607109 5.003986
H  3.460666 4.508728 8.904937
H  2.528782 4.291804 7.634211
H  10.266504 5.21677 6.327115
H  9.643595 6.239582 5.299055
C  9.693359 8.881058 2.472707
F  9.696974 10.063919 3.150926
F  10.956213 8.694578 1.997905
F  8.886645 9.048257 1.398194
C  2.263472 6.433388 12.137091
F  3.043605 6.848581 13.178149
F  1.376013 7.435756 11.888115
F  1.546179 5.374786 12.582427
C  0.112138 6.241198 8.036979
F  -0.18512 5.548568 9.175462
F  1.310986 6.855708 8.260982
F  -0.811125 7.23022 7.932084
C  6.254365 3.286121 1.443851
F  5.203647 3.708735 0.704791
F  7.371903 3.43452 0.678646
F  6.09006 1.961309 1.662933
C  7.431717 1.304243 7.393293
F  6.431071 0.432403 7.146869
F  7.856171 1.085767 8.666606
F  8.461301 0.984682 6.566428
C  7.15741 5.035916 12.63565
F  7.934151 3.936297 12.766781
F  7.841873 6.08007 13.157509
F  6.054189 4.847896 13.412954
exchangeener: -694.913723692779 hartree
correlationener: -33.924628959934 hartree
xcener: -728.838352652713 hartree
s2: 12.015880
chargesum: -0.0000000
charge: 0.644124 0.964823 0.605185 1.001647 -0.161991 -0.008755 0.176091 -0.135727 0.154843 -0.054708 0.145804 -0.204733 0.111487 0.135996 0.164694 -0.151033 0.167213 0.088374 0.158412 -0.073582 -0.031626 0.159496 -0.148993 0.143663 0.276388 -0.063222 0.021405 -0.150748 0.133327 -0.107674 0.164045 -0.122713 0.164695 -0.025187 0.184583 -0.035918 -0.194384 -0.032194 0.195399 -0.133958 0.167315 -0.063766 0.157448 -0.193204 0.125885 0.067259 0.155955 -0.104566 0.176380 0.035829 0.224602 -0.104628 -0.018350 0.162591 -0.148329 0.144640 0.297277 -0.114461 0.026500 -0.149431 0.135859 -0.102694 0.167438 -0.108049 0.170968 -0.016828 0.196635 -0.017379 -0.935415 -0.909620 -0.470611 -0.369351 -0.523508 -0.387593 0.303396 -0.522854 -0.395427 0.295250 -0.512449 -0.459195 0.367579 -0.538404 -0.418921 0.256076 -0.465851 -0.470273 0.222114 -0.438585 -0.482403 0.199232 0.305425 0.330098 0.248962 0.257556 0.187450 0.239455 0.522864 -0.207992 -0.176136 -0.184385 0.513517 -0.201545 -0.196187 -0.172312 0.498619 -0.188817 -0.222915 -0.197979 0.518195 -0.192523 -0.177168 -0.174450 0.484108 -0.169127 -0.182222 -0.179690 0.522359 -0.178872 -0.199138 -0.165782
charge: -0.104799 -0.132925 -0.095291 -0.138928 0.309341 -0.010304 0.036516 0.021896 0.031623 0.037240 0.030180 0.034137 0.026126 -0.112829 -0.111945 -0.009841 0.016770 0.360820 -0.235821 0.302319 0.008789 0.033968 -0.002621 0.029047 -0.102007 0.297219 -0.106634 0.018234 0.024208 0.028597 0.032380 0.009326 0.031241 -0.005262 0.033177 0.296952 0.297920 -0.015489 0.039066 0.021664 0.035746 0.034372 0.032694 0.018562 0.024585 -0.117665 -0.118735 -0.017909 0.013629 0.361829 -0.232975 0.298404 0.014083 0.034932 0.005610 0.032429 -0.097614 0.295230 -0.110259 0.023914 0.025539 0.036742 0.034784 0.022815 0.035424 0.005274 0.036092 0.296876 0.203076 0.205555 0.392062 0.407538 0.133150 0.128859 -0.530569 0.135458 0.123192 -0.522900 0.148811 0.177400 -0.490886 0.081137 0.094484 -0.566262 0.067599 0.112542 -0.571735 -0.018001 0.028851 -0.640201 -0.160270 -0.158752 -0.157385 -0.164326 -0.103878 -0.157838 -0.590025 0.152058 0.173494 0.175589 -0.585604 0.152863 0.160639 0.183843 -0.592768 0.166035 0.151546 0.161819 -0.594800 0.176689 0.176580 0.189201 -0.591372 0.192009 0.174167 0.175629 -0.595073 0.186251 0.171258 0.184795
qa: 0.6441 0.9648 0.6052 1.0016 -0.1620 -0.0088 0.1761 -0.1357 0.1548 -0.0547 0.1458 -0.2047 0.1115 0.1360 0.1647 -0.1510 0.1672 0.0884 0.1584 -0.0736 -0.0316 0.1595 -0.1490 0.1437 0.2764 -0.0632 0.0214 -0.1507 0.1333 -0.1077 0.1640 -0.1227 0.1647 -0.0252 0.1846 -0.0359 -0.1944 -0.0322 0.1954 -0.1340 0.1673 -0.0638 0.1574 -0.1932 0.1259 0.0673 0.1560 -0.1046 0.1764 0.0358 0.2246 -0.1046 -0.0184 0.1626 -0.1483 0.1446 0.2973 -0.1145 0.0265 -0.1494 0.1359 -0.1027 0.1674 -0.1080 0.1710 -0.0168 0.1966 -0.0174 -0.9354 -0.9096 -0.4706 -0.3694 -0.5235 -0.3876 0.3034 -0.5229 -0.3954 0.2953 -0.5124 -0.4592 0.3676 -0.5384 -0.4189 0.2561 -0.4659 -0.4703 0.2221 -0.4386 -0.4824 0.1992 0.3054 0.3301 0.2490 0.2576 0.1875 0.2395 0.5229 -0.2080 -0.1761 -0.1844 0.5135 -0.2015 -0.1962 -0.1723 0.4986 -0.1888 -0.2229 -0.1980 0.5182 -0.1925 -0.1772 -0.1745 0.4841 -0.1691 -0.1822 -0.1797 0.5224 -0.1789 -0.1991 -0.1658
va: 2.3539 3.2335 2.3570 3.1443 2.9623 3.9761 1.0046 3.9100 0.9949 3.9344 0.9928 4.0611 1.0112 3.8314 3.8235 3.9253 1.0072 3.4374 3.9246 2.8044 3.9401 0.9992 3.9034 1.0094 3.7214 3.0609 3.9315 3.9330 1.0105 3.9406 0.9898 3.8798 0.9888 3.9740 0.9934 3.0816 2.9712 3.9568 1.0072 3.9189 0.9930 3.9297 0.9914 3.9933 1.0092 3.9794 3.8651 3.9374 0.9986 3.4747 3.8232 2.8635 3.9385 0.9982 3.9478 1.0111 3.5992 2.9523 3.9836 3.9440 1.0095 3.9447 0.9893 3.8836 0.9877 3.9718 0.9882 3.1181 1.4602 1.4658 2.0968 2.1341 1.8792 2.1097 4.1488 1.8985 2.1032 4.1966 1.9453 1.9763 4.0821 1.8489 2.0570 4.2345 2.0232 1.9212 4.3155 2.0391 1.9536 4.4674 1.0254 0.9798 1.0854 1.0743 1.0475 1.0790 4.3809 1.0708 1.1308 1.1171 4.4244 1.0837 1.0927 1.1380 4.1981 1.1048 1.0373 1.0997 4.4326 1.0989 1.1265 1.1351 4.4872 1.1414 1.1180 1.1206 4.4328 1.1288 1.0893 1.1425
dispersion: -0.398495961 hartree
dipole: 0.539622018 4.043419440 4.583041458 52.720126234 -39.982466704 12.737659530 -15.928069744 13.076102822 -2.851966921
dipolemethod: SCF
magnitude: 13.834231263 au
magnitude: 35.163821355 debye
