program: Orca
programVersion: 6.0.1
elementType: Cu Ni Cu Ni N C H C H C H C H C C C H N C N C H C H C N C C H C H C H C H N N C H C H C H C H C C C H N C N C H C H C N C C H C H C H C H N O O O O O O C O O C O O C O O C O O C O O C H H H H H H C F F F C F F F C F F F C F F F C F F F C F F F
charge: 0
multiplicity: 7
keywords: UKS b3lyp d3bj def2-TZVPP def2/J RIJCOSX VeryTightSCF defgrid3
formula: C44H28Cu2F18N10Ni2O16
InChI: InChI=1/2C16H11N5.6C2F3O2.2Cu.2Ni.2H2O.2HO/c2*1-3-8-17-12(5-1)14-7-10-21-11-15(20-16(21)19-14)13-6-2-4-9-18-13;6*3-2(4,5)1(6)7;;;;;;;;/h2*1-11H;;;;;;;;;;;2*1H2;2*1H/q2*-4;;;;-2;2*-1;4*+3;;;;/rC38H28Cu2F9N10Ni2O10.3C2F3O2/c41-36(42,43)31(62)66-39-52-15-5-1-9-23(52)29-21-50-19-13-27-25-11-3-7-17-54(25)60(64,58(27)34(50)56(29)39)68-33(38(47,48)49)69-61(65,70(39)60)55-18-8-4-12-26(55)28-14-20-51-22-30-24-10-2-6-16-53(24)40(71(60)61,57(30)35(51)59(28)61)67-32(63)37(44,45)46;3*3-2(4,5)1(6)7/h1-22,70-71H,64-65H2;;;
120 atoms
Cu 5.78446 7.133552 9.424478
Ni 5.082214 4.88151 6.765012
Cu 6.616337 6.700196 4.247474
Ni 8.024192 5.584343 7.306188
N  6.031707 9.059261 10.083958
C  6.732427 9.435526 11.160749
H  7.198084 8.635123 11.723864
C  6.855522 10.772362 11.528177
H  7.438932 11.037255 12.402181
C  6.221638 11.744709 10.755884
H  6.300785 12.794425 11.017191
C  5.486814 11.356962 9.639387
H  4.987623 12.087504 9.01314
C  5.413153 10.000461 9.327041
C  4.723029 9.448173 8.173516
C  3.899489 9.996432 7.21385
H  3.5310 10.996524 7.05351
N  3.564517 8.952293 6.380262
C  4.204539 7.798865 6.857558
N  4.901639 8.100946 7.943731
C  2.774401 8.883817 5.265841
H  2.298734 9.799933 4.941959
C  2.646431 7.677401 4.640524
H  2.025282 7.609518 3.759432
C  3.335861 6.544525 5.14012
N  4.103567 6.622139 6.237966
C  3.287289 5.223957 4.504077
C  2.542989 4.949205 3.357535
H  1.96418 5.725355 2.873162
C  2.551721 3.655735 2.844732
H  1.980116 3.418816 1.954178
C  3.300889 2.676757 3.490767
H  3.333647 1.656718 3.12606
C  4.030645 3.028099 4.62478
H  4.641262 2.309227 5.157901
N  4.030373 4.271558 5.116392
N  5.780017 8.170932 3.110644
C  5.073374 7.981265 1.989123
H  4.977738 6.953533 1.659577
C  4.496981 9.041704 1.296194
H  3.926043 8.846201 0.396121
C  4.668184 10.337454 1.780935
H  4.228813 11.182714 1.262412
C  5.405765 10.538664 2.943852
H  5.551245 11.531328 3.35406
C  5.948166 9.429847 3.590068
C  6.710879 9.475594 4.825526
C  7.243239 10.503359 5.572686
H  7.227785 11.574643 5.455273
N  7.892968 9.892551 6.622983
C  7.730352 8.507108 6.483019
N  7.011116 8.257327 5.39781
C  8.612049 10.393757 7.673108
H  8.705774 11.469669 7.737012
C  9.156061 9.510437 8.560162
H  9.730007 9.893444 9.391634
C  8.953225 8.118594 8.386941
N  8.23733 7.63841 7.35898
C  9.485331 7.105129 9.304308
C  10.224516 7.413138 10.446059
H  10.426269 8.44238 10.7141
C  10.695015 6.374336 11.244301
H  11.267957 6.591791 12.138905
C  10.418701 5.060824 10.877399
H  10.767734 4.22254 11.468932
C  9.664572 4.827999 9.728869
H  9.407941 3.826634 9.405241
N  9.202435 5.823778 8.963837
O  6.211102 5.561432 8.327758
O  6.80268 5.390961 5.69014
O  3.538198 4.261738 7.985193
O  9.688952 5.384404 6.046645
O  6.666645 6.415998 11.049048
O  6.579511 4.182093 10.61455
C  6.76389 5.178372 11.328756
O  6.189051 5.345862 2.872266
O  7.271809 3.557662 3.773664
C  6.673459 4.168856 2.8762
O  8.08623 3.524037 7.471569
O  5.90874 2.992103 7.05043
C  7.10941 2.74911 7.31202
O  3.850233 7.102146 10.568312
O  3.20428 4.919262 10.546868
C  3.214818 6.096024 10.966822
O  10.181597 7.62374 4.755167
O  8.657169 6.983663 3.19556
C  9.566008 7.706191 3.662403
O  -0.375867 5.92384 5.742693
O  1.203843 4.661813 6.769362
C  0.383755 5.616469 6.67697
H  6.299323 4.870413 9.033749
H  7.074077 4.59593 5.16376
H  3.530774 4.596626 8.924954
H  2.641281 4.481025 7.604586
H  10.487043 5.204677 6.568056
H  9.872271 6.249791 5.555171
C  10.039215 8.88491 2.74738
F  10.358283 9.998416 3.457879
F  11.156605 8.526864 2.049607
F  9.106012 9.25428 1.835931
C  2.30305 6.400555 12.202543
F  3.051592 6.787907 13.275985
F  1.435084 7.418249 11.942089
F  1.55892 5.343064 12.604911
C  0.328621 6.528288 7.955591
F  -0.064621 5.81957 9.054252
F  1.551746 7.057557 8.255041
F  -0.525305 7.575967 7.841826
C  6.511712 3.429414 1.511184
F  5.460051 3.870999 0.784424
F  7.631124 3.619363 0.757474
F  6.359897 2.095538 1.675918
C  7.485706 1.244095 7.465469
F  8.041578 1.005874 8.681948
F  8.399841 0.881945 6.526969
F  6.426036 0.418542 7.336761
C  7.126353 4.920605 12.824883
F  7.783158 3.751008 12.994188
F  5.983816 4.854733 13.564901
F  7.894261 5.89797 13.361275
exchangeener: -694.919590595345 hartree
correlationener: -33.927975779777 hartree
xcener: -728.847566375122 hartree
s2: 12.016751
chargesum: -0.0000000
charge: 0.603007 1.001263 0.555245 1.039115 -0.081553 -0.050454 0.175545 -0.116774 0.160730 -0.105283 0.161442 -0.175435 0.133893 -0.039972 0.309354 -0.116053 0.171711 0.065646 0.138330 -0.021060 -0.025048 0.154065 -0.106513 0.131946 0.168546 -0.119317 0.153021 -0.178694 0.119457 -0.061106 0.148007 -0.134799 0.156362 0.010420 0.171492 -0.116171 -0.028367 -0.040851 0.185531 -0.108484 0.166219 -0.102049 0.164027 -0.172587 0.134781 -0.031206 0.308829 -0.111295 0.175879 0.053885 0.199200 -0.073925 -0.014932 0.160897 -0.128389 0.144275 0.183944 -0.150264 0.078970 -0.158370 0.131221 -0.072537 0.158990 -0.128141 0.169362 -0.017049 0.191596 -0.160651 -0.923544 -0.892693 -0.466290 -0.361203 -0.514298 -0.395540 0.301716 -0.522379 -0.401482 0.289804 -0.521476 -0.466214 0.361831 -0.535591 -0.424519 0.247583 -0.475106 -0.474978 0.237752 -0.435266 -0.483964 0.198114 0.302825 0.326479 0.251857 0.256567 0.187715 0.238305 0.521968 -0.198614 -0.180391 -0.190058 0.509279 -0.200824 -0.195948 -0.174509 0.497805 -0.187636 -0.218497 -0.195405 0.521870 -0.192452 -0.176533 -0.176249 0.489256 -0.183673 -0.177593 -0.168219 0.525717 -0.179252 -0.165235 -0.199689
charge: -0.123826 -0.119622 -0.114956 -0.124569 0.293989 -0.015049 0.034135 0.001491 0.029007 0.025946 0.031349 0.016589 0.026845 -0.109943 -0.136896 -0.027175 0.011418 0.358567 -0.229994 0.266100 0.011603 0.032445 0.028684 0.037051 -0.072954 0.317457 -0.106294 0.042180 0.025090 0.041150 0.031893 0.028590 0.033338 -0.003528 0.034901 0.311819 0.293939 -0.005538 0.036561 0.013419 0.032699 0.034216 0.033526 0.021698 0.027645 -0.114859 -0.135151 -0.020533 0.014328 0.361975 -0.228884 0.266420 0.015801 0.034237 0.014634 0.032158 -0.080963 0.317476 -0.113161 0.026401 0.023169 0.039421 0.034657 0.030125 0.037776 -0.007069 0.037240 0.300415 0.203442 0.205770 0.393298 0.408946 0.130620 0.123472 -0.530222 0.131911 0.120000 -0.522063 0.151017 0.178806 -0.493269 0.081819 0.089723 -0.569035 0.064270 0.110797 -0.570162 -0.015755 0.031853 -0.638917 -0.157814 -0.156692 -0.158564 -0.167113 -0.104650 -0.159948 -0.589596 0.160805 0.169130 0.171971 -0.585768 0.153540 0.159736 0.181682 -0.592899 0.167211 0.152397 0.164219 -0.595089 0.176908 0.176581 0.188636 -0.592635 0.174364 0.176778 0.193294 -0.595387 0.186683 0.184731 0.170558
qa: 0.6030 1.0013 0.5552 1.0391 -0.0816 -0.0505 0.1755 -0.1168 0.1607 -0.1053 0.1614 -0.1754 0.1339 -0.0400 0.3094 -0.1161 0.1717 0.0656 0.1383 -0.0211 -0.0250 0.1541 -0.1065 0.1319 0.1685 -0.1193 0.1530 -0.1787 0.1195 -0.0611 0.1480 -0.1348 0.1564 0.0104 0.1715 -0.1162 -0.0284 -0.0409 0.1855 -0.1085 0.1662 -0.1020 0.1640 -0.1726 0.1348 -0.0312 0.3088 -0.1113 0.1759 0.0539 0.1992 -0.0739 -0.0149 0.1609 -0.1284 0.1443 0.1839 -0.1503 0.0790 -0.1584 0.1312 -0.0725 0.1590 -0.1281 0.1694 -0.0170 0.1916 -0.1607 -0.9235 -0.8927 -0.4663 -0.3612 -0.5143 -0.3955 0.3017 -0.5224 -0.4015 0.2898 -0.5215 -0.4662 0.3618 -0.5356 -0.4245 0.2476 -0.4751 -0.4750 0.2378 -0.4353 -0.4840 0.1981 0.3028 0.3265 0.2519 0.2566 0.1877 0.2383 0.5220 -0.1986 -0.1804 -0.1901 0.5093 -0.2008 -0.1959 -0.1745 0.4978 -0.1876 -0.2185 -0.1954 0.5219 -0.1925 -0.1765 -0.1762 0.4893 -0.1837 -0.1776 -0.1682 0.5257 -0.1793 -0.1652 -0.1997
va: 2.3764 3.1903 2.3950 3.1105 3.0367 3.9933 1.0033 3.8710 0.9899 3.9308 0.9913 3.9533 1.0059 4.0124 3.6060 3.9578 0.9980 3.4376 4.0190 2.9881 3.8715 1.0019 3.8960 1.0243 3.8406 2.8490 3.8300 4.0921 1.0126 3.9279 0.9928 3.9130 0.9937 3.9709 1.0078 2.9854 3.0696 3.9939 0.9996 3.8859 0.9891 3.9457 0.9908 3.9776 1.0053 4.0236 3.4938 3.9694 0.9974 3.4609 3.9129 2.8569 3.9188 1.0001 3.8895 1.0172 3.8860 2.9085 3.9629 4.0027 1.0108 3.9379 0.9912 3.9198 0.9914 3.9561 1.0104 2.9866 1.4625 1.4657 2.0983 2.1427 1.9013 2.0975 4.1399 1.9159 2.0941 4.1967 1.9301 1.9632 4.0913 1.8503 2.0504 4.2442 2.0038 1.9278 4.2903 2.0384 1.9528 4.4664 1.0280 0.9833 1.0860 1.0736 1.0484 1.0822 4.3849 1.0891 1.1235 1.1048 4.4320 1.0846 1.0926 1.1341 4.2121 1.1061 1.0434 1.1033 4.4230 1.0997 1.1269 1.1327 4.4766 1.1168 1.1230 1.1425 4.4248 1.1285 1.1428 1.0884
dispersion: -0.403064594 hartree
dipole: 4.267079692 1.164268026 5.431347718 48.897392866 -37.744850138 11.152542728 -14.283542936 12.084842535 -2.198700401
dipolemethod: SCF
magnitude: 12.598136004 au
magnitude: 32.021916900 debye
