program: Orca
programVersion: 6.0.0
elementType: N C H C H C H C H C C C H N C N C H C H C N C C H C H C H C H N
charge: 0
multiplicity: 1
keywords: TPSS D3BJ TightOpt Freq def2-TZVPP def2/J RIJCOSX VeryTightSCF defgrid3 CPCM(Acetonitrile)
frequency: 0.00 0.00 0.00 0.00 0.00 0.00 24.99 32.46 53.25 64.31 83.51 133.07 162.44 190.36 226.23 284.25 313.19 345.98 346.61 397.78 398.61 426.58 443.02 492.56 505.80 564.33 597.44 613.31 616.48 649.09 661.90 688.21 697.76 739.26 745.22 746.45 747.94 770.04 795.90 810.02 826.42 839.70 907.39 911.67 911.75 956.34 965.57 976.14 978.80 989.77 990.96 1013.36 1016.56 1042.61 1046.76 1067.15 1082.41 1095.52 1097.35 1113.57 1151.67 1152.54 1212.58 1225.76 1257.46 1276.03 1279.71 1290.28 1296.02 1326.78 1346.45 1374.46 1428.17 1436.44 1443.09 1467.00 1477.54 1502.96 1510.83 1536.60 1576.42 1577.33 1589.61 1595.32 1616.70 3119.20 3122.17 3146.99 3148.72 3164.58 3165.76 3174.50 3178.64 3188.66 3208.51 3252.47
frequency: 24.99 32.46 53.25 64.31 83.51 133.07 162.44 190.36 226.23 284.25 313.19 345.98 346.61 397.78 398.61 426.58 443.02 492.56 505.80 564.33 597.44 613.31 616.48 649.09 661.90 688.21 697.76 739.26 745.22 746.45 747.94 770.04 795.90 810.02 826.42 839.70 907.39 911.67 911.75 956.34 965.57 976.14 978.80 989.77 990.96 1013.36 1016.56 1042.61 1046.76 1067.15 1082.41 1095.52 1097.35 1113.57 1151.67 1152.54 1212.58 1225.76 1257.46 1276.03 1279.71 1290.28 1296.02 1326.78 1346.45 1374.46 1428.17 1436.44 1443.09 1467.00 1477.54 1502.96 1510.83 1536.60 1576.42 1577.33 1589.61 1595.32 1616.70 3119.20 3122.17 3146.99 3148.72 3164.58 3165.76 3174.50 3178.64 3188.66 3208.51 3252.47
formula: C16H11N5
InChI: InChI=1/C16H11N5/c1-3-8-17-12(5-1)14-7-10-21-11-15(20-16(21)19-14)13-6-2-4-9-18-13/h1-11H
32 atoms
N  4.515687 0.849978 0.000289
C  5.814426 0.524777 0.000069
H  6.51387 1.358004 0.000297
C  6.284191 -0.78978 -0.000425
H  7.350475 -0.989571 -0.000602
C  5.34972 -1.824705 -0.000682
H  5.671044 -2.861684 -0.001068
C  3.995072 -1.508134 -0.000444
H  3.232871 -2.278725 -0.000637
C  3.615396 -0.158751 0.000021
C  2.20342 0.22754 0.000189
C  1.704547 1.523787 0.000357
H  2.187713 2.48705 0.000447
N  0.341776 1.387774 0.000365
C  0.062876 -0.005389 0.000168
N  1.194086 -0.706467 0.000075
C  -0.682849 2.293516 0.00042
H  -0.413698 3.342486 0.000565
C  -1.961266 1.815542 0.000253
H  -2.801134 2.495882 0.00027
C  -2.187497 0.408852 0.000102
N  -1.188646 -0.474539 0.000106
C  -3.569088 -0.124188 -0.000052
C  -3.810424 -1.505358 0.000796
H  -2.974638 -2.194627 0.001628
C  -5.125181 -1.957355 0.000577
H  -5.33964 -3.021483 0.001245
C  -6.160309 -1.022394 -0.000513
H  -7.200651 -1.3299 -0.000747
C  -5.827044 0.332347 -0.001285
H  -6.606247 1.091202 -0.002145
N  -4.566788 0.784847 -0.001044
totalener: -890.59172987155739 hartree
nucrepener: 1417.97827857648758 hartree
electener: -2308.54672225350168 hartree
oneelecener: -4021.55371035991175 hartree
twoeener: 1713.00698810641006 hartree
cpcmener: -0.02328619454308 hartree
kineticenergy: 886.11414117434560 hartree
exchangeener: -120.960920655673 hartree
correlationener: -4.792194379960 hartree
xcener: -125.753115035633 hartree
s2: 0.000000
dispersion: -0.053303218 hartree
dispersion: -0.053294427 hartree
dispersion: -0.053259578 hartree
dispersion: -0.053246012 hartree
dispersion: -0.053242251 hartree
dispersion: -0.053243008 hartree
dispersion: -0.053243571 hartree
dispersion: -0.053243666 hartree
dispersion: -0.053243816 hartree
elementType: N C H
energy: -386.1749 -384.1257 -383.8804 -383.8107 -383.5763 -274.3453 -273.5914 -273.4173 -273.1058 -273.0812 -272.8857 -272.8499 -272.8275 -272.7753 -272.3510 -272.3046 -272.2788 -272.1490 -272.1474 -272.0831 -272.0639 -26.8330 -24.3432 -24.1077 -23.7669 -23.3578 -20.4765 -20.3758 -20.2631 -19.8796 -19.6263 -18.6251 -17.2186 -16.6550 -16.2493 -15.8987 -15.8864 -15.2788 -14.7648 -13.8158 -13.2811 -12.9729 -12.7243 -12.1686 -12.0587 -11.9248 -11.8031 -11.4503 -11.2233 -11.0628 -10.8332 -10.4829 -10.4655 -10.3179 -10.2116 -9.8533 -9.7548 -9.1873 -9.0419 -8.9572 -8.8776 -7.5640 -7.3251 -7.2436 -7.1699 -6.8586 -6.7103 -6.3137 -6.2862 -6.1541 -5.4686 -2.8673 -2.0725 -1.7196 -1.4651 -1.1336 -0.3981 0.8509 1.2095 1.3540 1.4636 1.6404 electronvolt
chargesum: -0.0000000
charge: -0.283490 -0.023064 0.097323 -0.091460 0.111525 -0.057367 0.116301 -0.162861 0.082257 0.082503 0.226718 -0.165277 0.125244 0.085325 0.120488 -0.289535 -0.004139 0.128532 -0.122087 0.097393 0.167721 -0.225633 0.161124 -0.150026 0.086231 -0.058988 0.118065 -0.081441 0.113949 -0.032742 0.098970 -0.271560
charge: 0.156568 -0.100224 0.016155 -0.011479 0.023370 0.013812 0.028348 0.012546 0.021261 -0.170069 -0.196174 -0.032740 0.012195 0.346215 -0.336529 0.110201 0.004514 0.034732 -0.004093 0.023534 -0.156195 0.175993 -0.162148 0.017952 0.020815 0.016660 0.029106 -0.004106 0.024913 -0.096473 0.016910 0.164431
qa: -0.2835 -0.0231 0.0973 -0.0915 0.1115 -0.0574 0.1163 -0.1629 0.0823 0.0825 0.2267 -0.1653 0.1252 0.0853 0.1205 -0.2895 -0.0041 0.1285 -0.1221 0.0974 0.1677 -0.2256 0.1611 -0.1500 0.0862 -0.0590 0.1181 -0.0814 0.1139 -0.0327 0.0990 -0.2716
va: 3.0762 4.0784 1.0031 3.9026 1.0018 3.9230 1.0015 3.9700 1.0530 3.9824 3.7112 3.9952 1.0341 3.4453 4.2791 3.0607 3.9368 1.0045 3.9010 1.0562 3.8837 3.0397 3.8506 3.9638 1.0505 3.9225 1.0007 3.8972 1.0006 4.0895 1.0016 3.0698
dispersion: -0.053243750 hartree
energy: -890.648871111519 hartree
dipole: -0.363742218 -0.130978091 -0.494720309 -1.872979512 2.467112860 0.594133348 -0.000357300 0.000816153 0.000458853
dipolemethod: SCF
magnitude: 0.773138300 au
magnitude: 1.965161383 debye
temp: 298.15 k
press: 1.00 atm
zeropoint: 0.23924438 hartree
thermalvibcorrection: 0.01254008 hartree
thermalrotcorrection: 0.00141627 hartree
thermaltrasncorrection: 0.00141627 hartree
thermaltotal: -890.39425411 hartree
thermalcorr: 0.01537262 hartree
nonthermalcorr: 0.23924438 hartree
totalcorr: 0.25461700 hartree
thermalcorrenthalpy: 0.00094421 hartree
totalenthalpy: -890.39330990 hartree
vibrat: 0.02167465 hartree
rotat: 0.01627134 hartree
transl: 0.02029516 hartree
total: 0.05824115 hartree
totalentropycorr: -0.05824115 hartree
gibbsenthalpy: -890.45155105 hartree
gibbsminuselec: 0.19732006 hartree
