program: Gaussian 09
title: 000061027
version: EM64L-G09RevD.01
frameworkgroup: C1[X(C15H28O2)]
method: RPBEPBE
basis: SDD
operation: Freq
keyword: #pfreq=noraman
keyword: PBEPBE/SDD
title: #p freq=noraman PBEPBE/SDD
converged: YES YES NO NO
title: Mulliken charges:
elementType: O O C C C C C C C C C C C C C C C H H H H H H H H H H H H H H H H H H H H H H H H H H H H
charge: -0.265620 -0.239164 -0.384988 -0.381997 -0.367725 -0.373885 -0.378503 -0.380968 -0.521874 -0.457159 0.237548 -0.367817 -0.262926 -0.034783 -0.345497 -0.686831 -0.598383 0.196097 0.196328 0.194820 0.192027 0.191230 0.189769 0.196636 0.191096 0.213578 0.218547 0.194298 0.212150 0.242939 0.244747 0.205511 0.198349 0.206617 0.206715 0.220058 0.220987 0.211626 0.196785 0.196654 0.211820 0.218515 0.211869 0.213448 0.217356
chargesum: 0.00000
title: Mulliken charges with hydrogens summed into heavy atoms:
elementType: O O C C C C C C C C C C C C C C C
charge: -0.265620 -0.239164 0.007437 0.004851 0.013274 0.013846 0.053622 0.025480 -0.034189 -0.053299 0.237548 0.045515 0.178119 0.176844 0.047942 -0.044627 -0.167578
polarizability: 2.41983526e+02 2.44974203e+00 1.43576158e+02 -8.51325879e+00 1.67325939e+00 1.33624265e+02
1716.lowfreq: -50.1769 -37.7280 -7.6391 -1.3036 -0.0017 0.0014 0.0019 8.6455 16.7224
frequency: -43.9362 -13.8365 13.8434 19.3260 23.2982 34.7747 53.7339 60.6211 73.9710 91.5601 95.6757 99.5979 114.8839 134.3537 137.2879 146.8550 174.5972 181.4868 234.2601 234.9217 264.6120 301.9920 351.0416 397.3146 410.8918 449.5300 463.1122 513.8581 548.4364 637.0351 677.5019 717.2605 721.2333 736.6202 739.5552 780.9371 794.2191 841.5464 855.2512 909.5975 910.6980 921.0696 927.4007 929.3144 939.6220 982.3291 993.7461 1002.0460 1006.1199 1037.6410 1041.1242 1042.0593 1065.3609 1076.6327 1079.6176 1082.3611 1093.3971 1110.6341 1123.9166 1128.4067 1146.7526 1174.9605 1199.7338 1208.3721 1210.5646 1235.7015 1242.1381 1264.8942 1269.3773 1270.2063 1273.5765 1279.2880 1281.2894 1285.4950 1290.3126 1293.2914 1296.1136 1307.3464 1331.9364 1342.4080 1348.1176 1353.6246 1360.7010 1373.2581 1389.8966 1425.8815 1438.9006 1455.9003 1458.3777 1460.6756 1462.5313 1467.1798 1470.4255 1470.8499 1477.8082 1479.0573 1480.2480 1485.1596 1489.3152 1640.0805 1657.9111 2948.4626 2950.0762 2951.4543 2952.6377 2960.5721 2966.6571 2968.4013 2975.5077 2983.2358 2983.6440 2989.5813 2990.5170 2993.3114 2999.3667 3002.9542 3011.6655 3014.5957 3026.7061 3032.6437 3042.2517 3043.8505 3060.4317 3068.3829 3069.5696 3076.1649 3076.7346 3088.9616 3192.4446
redmass: 1.8108 2.3690 4.1823 2.4904 4.0659 2.7826 3.7132 2.9674 2.2982 2.2603 2.1632 2.5944 2.8622 2.0602 2.2538 4.2987 3.0242 2.8523 1.1652 3.6566 3.7279 3.8209 3.3009 2.8110 2.9280 2.6347 2.9735 3.5229 2.6748 1.5468 5.8042 1.0616 1.0961 1.0699 1.1623 1.2626 1.1387 1.3302 5.8562 1.8226 1.3866 2.0042 6.9563 1.1647 1.3396 1.3736 4.4868 1.2803 2.1795 3.5191 2.0793 2.1973 2.4595 2.5150 2.1688 2.2058 3.5261 1.4611 2.6126 3.0532 1.4863 1.9326 1.4188 1.4203 1.3475 1.3504 1.3408 1.2129 1.1635 1.2893 1.3065 1.0756 1.1121 1.0798 1.1932 1.1035 1.1349 1.3815 1.4370 1.4321 1.5865 1.6541 1.6632 1.6320 1.2203 1.1772 1.0859 1.0917 1.0698 1.0758 1.0748 1.0769 1.0964 1.0695 1.0423 1.0999 1.0649 1.1008 1.0889 9.8054 4.7420 1.0587 1.0590 1.0615 1.0591 1.0596 1.0603 1.0585 1.0365 1.0633 1.0946 1.0597 1.0981 1.0600 1.0566 1.0993 1.1003 1.1001 1.1002 1.1020 1.1036 1.1034 1.1031 1.1043 1.0798 1.0994 1.1045 1.0737 1.1144
irintensity: 0.0109 0.0093 0.2102 0.6770 0.3000 0.2554 0.1419 0.2306 0.2424 0.0262 0.0356 0.4625 0.4443 0.0990 0.1006 0.0488 2.9469 4.8358 0.4790 6.5198 2.0868 5.7861 0.8183 2.4082 8.4640 0.5970 1.4257 1.8667 1.3416 17.0276 3.5986 16.3561 0.9603 9.4220 3.2292 1.6021 0.4728 2.6224 8.7729 3.5586 4.3958 6.4905 39.9836 0.4280 80.4486 3.2544 10.7829 8.9078 5.6057 1.7537 55.6834 11.2701 12.4007 22.6757 14.4706 13.7667 31.8633 13.9181 16.1244 274.0757 2.7834 13.8577 25.5636 28.0853 0.2629 4.1450 19.3190 4.1690 0.2534 0.0502 19.2647 4.2032 2.1375 0.0778 3.7358 0.2454 0.7056 18.4003 17.6688 0.1414 7.0397 2.9544 14.8247 1.3169 8.9941 3.4497 23.2315 3.1089 0.1572 0.6561 0.1555 0.5986 4.8892 0.1793 13.0579 0.6910 5.5131 28.6142 20.5778 170.9202 22.3474 2.7234 9.4930 10.1092 2.0764 27.7981 140.9532 29.0596 31.8132 4.3891 1.5666 16.5583 2.5788 36.3507 51.9059 2.1500 6.5954 4.1085 7.0206 6.2365 1.6584 130.5569 85.6589 0.1304 49.1819 50.3574 134.3421 7.4907 33.5447
temp: 298.150 k
press: 1.00000 atm
elementType: 8 8 6 6 6 6 6 6 6 6 6 6 6 6 6 6 6 1 1 1 1 1 1 1 1 1 1 1 1 1 1 1 1 1 1 1 1 1 1 1 1 1 1 1 1
symmnumber: 1
zpe: 1045539.4 jmol-1
zpe.correction: 0.398225 hartree
zpe.thermalcorrener: 0.419070 hartree
zpe.thermalcorrenthalpy: 0.420014 hartree
zpe.thermalcorrgfe: 0.343589 hartree
zpe.sumelectzpe: -737.436077 hartree
zpe.sumelectthermal: -737.415232 hartree
zpe.sumelectthermalent: -737.414288 hartree
zpe.sumelectthermalfe: -737.490713 hartree
dipole: 1.2838 -1.5954 -0.2340
dipole: 2.0611
quadrupole: -100.9475 -115.0483 -103.5366
quadrupole: -3.4944 0.8932 0.6979
quadrupole: 5.5633 -8.5375 2.9742 -3.4944 0.8932 0.6979
hfenergy: -737.8343019 hartree
pointgroup: C01 [X(C15H28O2)]
dipole: -0.5032456 -0.63515 0.0297499 debye
polarizability: 241.9340953|-1.3068053|143.8030493|-9.0659467|-0.6580687|133.4468043 unknown
InChI: InChI=1S/C15H28O2/c1-3-5-7-8-9-10-11-12-13-15(16)17-14-6-4-2/h3H,1,4-14H2,2H3
charge 0 multiplicity 1
45 atoms
O  -4.197198 -0.274456 0.031849
O  -3.135396 1.794469 0.184627
C  2.066339 0.494476 0.065109
C  3.339941 -0.379927 0.101482
C  0.760567 -0.331156 0.098372
C  4.64822 0.4419 0.071983
C  -0.509517 0.54676 0.067537
C  5.917933 -0.43733 0.119885
C  -1.799112 -0.295487 0.103748
C  7.230093 0.392083 0.085529
C  -3.06563 0.545845 0.111782
C  -6.59732 -0.655212 -0.059841
C  -5.519137 0.422993 0.047929
C  8.469593 -0.467969 0.213637
C  -8.020688 -0.048003 -0.049663
C  -9.119837 -1.125973 -0.162884
C  9.480131 -0.537306 -0.689596
H  2.077886 1.195812 0.925313
H  2.078914 1.124289 -0.848776
H  3.328532 -1.080792 -0.759352
H  3.32505 -1.010618 1.015177
H  0.750033 -1.031299 -0.763449
H  0.752482 -0.962607 1.011914
H  4.668502 1.0677 -0.844617
H  4.658222 1.147093 0.929545
H  -0.507495 1.178451 -0.841745
H  -0.505182 1.247021 0.924472
H  5.901243 -1.056692 1.040879
H  5.91552 -1.145558 -0.732671
H  -1.817155 -0.942845 1.00352
H  -1.848964 -0.987553 -0.759113
H  7.275054 0.980879 -0.851446
H  7.200768 1.123022 0.922025
H  -6.442884 -1.233167 -0.99137
H  -6.487145 -1.366549 0.78136
H  -5.598622 1.003255 0.986387
H  -5.550813 1.134702 -0.798207
H  8.526146 -1.087755 1.123702
H  -8.167813 0.534133 0.882641
H  -8.121282 0.672335 -0.886857
H  -9.062215 -1.841236 0.678975
H  -10.128544 -0.674514 -0.154779
H  -9.014255 -1.702572 -1.100887
H  10.347939 -1.188702 -0.534896
H  9.466994 0.057661 -1.611731
