program: Orca
programVersion: 5.0.4
elementType: O N N C C C C C C C C C C C C C C C C C C C C C C H H H H H H H H H H H H H H H H H H H H H H H H H H H H H
charge: 1
multiplicity: 1
keywords: wB97X-D3 def2-TZVPP defgrid3 ESD(ABS)
formula: C22H29N2O
InChI: InChI=1/C22H29N2O/c1-3-22(25)24(20-12-8-5-9-13-20)21-14-15-23(16-18(21)2)17-19-10-6-4-7-11-19/h4-13,18,21,24H,3,14-17H2,1-2H3
54 atoms
O  0.231398 2.120083 0.275938
N  0.943355 -1.515952 0.090683
N  -1.053588 0.222971 0.474661
C  -1.086112 -0.807049 1.59282
C  -1.218635 -2.240918 1.050938
C  0.25975 -0.719264 2.318257
C  -0.130556 -2.504222 -0.007317
C  1.376506 -1.378521 1.482272
C  -2.592078 -2.708359 0.582178
C  2.042487 -1.82735 -0.828088
C  -2.207621 0.285168 -0.428571
C  -0.657236 1.642401 0.89226
C  3.074817 -0.73325 -0.890463
C  -1.459061 2.280824 1.982044
C  -1.957361 0.233234 -1.788219
C  -3.493182 0.418448 0.067909
C  2.73793 0.523254 -1.383359
C  4.373418 -0.956855 -0.451356
C  -0.823684 3.570849 2.477598
C  -3.023078 0.297247 -2.672356
C  -4.550313 0.483603 -0.824274
C  3.676761 1.539316 -1.427907
C  5.320063 0.056998 -0.500009
C  -4.317144 0.420373 -2.190984
C  4.972055 1.30692 -0.985543
H  -1.918016 -0.564939 2.251811
H  -0.97679 -2.840601 1.932969
H  0.154855 -1.223192 3.278065
H  0.519728 0.315004 2.550105
H  0.254764 -3.5263 0.108743
H  -0.560957 -2.438993 -1.010244
H  1.646459 -2.359133 1.897262
H  2.272036 -0.761825 1.506012
H  -3.362242 -2.493303 1.323718
H  -2.571812 -3.789006 0.438424
H  -2.890874 -2.25939 -0.36324
H  1.599787 -1.981479 -1.815127
H  2.519274 -2.774662 -0.54152
H  -2.45418 2.469852 1.568857
H  -1.600883 1.564551 2.793707
H  -0.941656 0.141938 -2.15441
H  -3.683979 0.448407 1.132588
H  1.730557 0.713124 -1.735467
H  4.6506 -1.93341 -0.070779
H  0.166134 3.386795 2.893216
H  -1.444737 4.012356 3.254235
H  -0.71852 4.29066 1.668714
H  -2.838641 0.252259 -3.737093
H  -5.560153 0.579615 -0.448978
H  3.400644 2.51226 -1.81318
H  6.329472 -0.131804 -0.158447
H  -5.147895 0.468962 -2.882034
H  5.708778 2.098642 -1.024842
H  -0.208756 -0.122314 -0.055508
totalener: -1040.38674194 hartree
nucrepener: 2329.19743223 hartree
electener: -3369.58417417 hartree
oneelecener: -6015.96802868 hartree
twoeener: 2646.38385451 hartree
kineticenergy: 1035.50674099 hartree
xcener: -104.485695233634 hartree
chargesum: 1.0000000
charge: -0.209094 -0.128360 0.245409 0.152019 -0.056085 -0.299525 -0.247013 -0.146626 -0.280092 -0.093914 0.078679 0.243165 0.037553 -0.169688 -0.212240 -0.315651 -0.178425 -0.152672 -0.222049 -0.055511 -0.059224 -0.127214 -0.120090 -0.123060 -0.108050 0.141847 0.100445 0.127415 0.116479 0.128304 0.122759 0.122149 0.136071 0.095154 0.123911 0.087118 0.124077 0.111276 0.126312 0.117185 0.125287 0.143624 0.092844 0.116985 0.098202 0.106373 0.103033 0.152355 0.152732 0.133402 0.140407 0.154388 0.140825 0.106794
charge: 0.240246 0.216860 0.447274 -0.045363 -0.077032 0.002383 -0.058256 -0.046528 0.026828 -0.059932 -0.118646 -0.260538 -0.096748 -0.031112 0.004799 -0.005931 -0.011750 -0.007027 0.034434 0.020191 0.016772 -0.003115 -0.002479 0.023371 -0.000775 0.029125 0.048199 0.038129 0.026812 0.025952 0.026101 0.021837 0.032316 0.019734 0.027999 0.017600 0.032805 0.027590 0.046626 0.036202 0.030809 0.026956 0.014527 0.023910 0.022297 0.023081 0.025353 0.034993 0.034352 0.025267 0.026272 0.035011 0.026073 -0.013855
qa: -0.2091 -0.1284 0.2454 0.1520 -0.0561 -0.2995 -0.2470 -0.1466 -0.2801 -0.0939 0.0787 0.2432 0.0376 -0.1697 -0.2122 -0.3157 -0.1784 -0.1527 -0.2220 -0.0555 -0.0592 -0.1272 -0.1201 -0.1231 -0.1081 0.1418 0.1004 0.1274 0.1165 0.1283 0.1228 0.1221 0.1361 0.0952 0.1239 0.0871 0.1241 0.1113 0.1263 0.1172 0.1253 0.1436 0.0928 0.1170 0.0982 0.1064 0.1030 0.1524 0.1527 0.1334 0.1404 0.1544 0.1408 0.1068
va: 2.2433 2.8413 3.4648 3.6666 3.8514 3.9796 3.8951 3.8482 3.9792 3.7984 3.6527 4.0327 3.5322 3.9052 4.0876 4.0639 3.9902 3.9731 3.9787 3.9435 3.9724 3.9935 3.9757 3.9990 3.9568 0.9846 1.0077 1.0133 1.0107 1.0112 0.9996 1.0090 1.0073 1.0058 1.0044 0.9961 0.9944 1.0092 0.9967 1.0048 1.0151 1.0077 1.0212 1.0137 1.0060 1.0049 1.0066 0.9966 0.9962 1.0011 0.9984 0.9951 0.9971 1.1780
energy: 40231.1 44122.7 44312.2 46416.5 48903.4 49163.9 49678.9 50258.6 54294.2 54719.0 cm-1
dispersion: -0.033685514 hartree
energy: -1040.237121260773 hartree
dipole: -5.55775 3.34109 -2.21666 -5.55410 5.16407 -0.39003 10.12782 -8.91976 1.20806
magnitude: 2.55443 au
magnitude: 6.49284 debye
