program: Gaussian 09
title: 000061024
version: EM64L-G09RevD.01
frameworkgroup: C1[X(C12H24O2)]
method: RPBEPBE
basis: SDD
operation: Freq
keyword: #pfreq=noraman
keyword: PBEPBE/SDD
title: #p freq=noraman PBEPBE/SDD
converged: YES YES NO NO
title: Mulliken charges:
elementType: O O C C C C C C C C C C C C H H H H H H H H H H H H H H H H H H H H H H H H
charge: -0.264894 -0.247778 -0.378046 -0.370912 -0.376306 -0.352894 -0.393029 -0.356339 -0.284289 -0.695840 -0.181849 0.259950 -0.686136 -0.690135 0.194350 0.194258 0.190213 0.190338 0.194577 0.194402 0.188285 0.188317 0.212011 0.211042 0.195342 0.195153 0.224954 0.224821 0.215776 0.209769 0.209854 0.236786 0.220614 0.229700 0.226435 0.213459 0.220489 0.237549
chargesum: 0.00000
title: Mulliken charges with hydrogens summed into heavy atoms:
elementType: O O C C C C C C C C C C C C
charge: -0.264894 -0.247778 0.010562 0.009639 0.012674 0.023708 0.030024 0.034156 0.165486 -0.060440 0.054937 0.259950 -0.009386 -0.018638
polarizability: 1.84980928e+02 -6.03216271e-02 1.21074446e+02 3.85247649e-01 -1.66806026e+00 1.12445856e+02
1716.lowfreq: -0.0008 -0.0006 -0.0001 5.7403 7.9427 14.8659 22.7726 26.4982 38.2415
frequency: 14.5530 24.9001 37.9889 41.6454 56.5536 85.2875 96.5892 104.6674 130.7892 148.6012 158.7501 167.1343 180.0753 201.4150 227.0112 232.4378 261.7259 280.6493 299.0742 328.3480 374.7395 430.5104 474.9441 511.3394 639.3099 715.3264 722.5994 730.5785 752.6082 794.4383 813.2364 858.5092 874.0268 890.6880 928.3726 937.6650 940.1547 961.6351 995.2105 1011.5115 1023.2459 1047.8752 1077.4915 1080.2500 1087.0646 1097.3838 1106.1635 1115.6393 1126.5535 1150.0528 1176.7784 1187.9641 1222.2790 1223.5216 1258.5874 1265.6061 1277.6182 1284.4720 1294.2244 1296.8406 1303.3999 1305.7386 1335.1151 1342.9466 1357.1189 1360.0297 1373.5753 1378.9582 1390.9721 1396.8279 1461.7776 1462.5823 1465.5587 1467.4126 1469.0352 1471.0745 1474.3308 1477.1587 1478.4390 1480.4429 1486.6235 1489.3610 1490.5455 1637.1652 2951.8668 2953.6865 2956.7364 2963.7665 2969.6000 2972.3153 2983.6838 2986.4658 2987.9776 2989.9490 2994.6649 3000.4193 3006.8619 3023.3587 3032.6238 3037.5294 3046.4016 3068.9388 3070.9489 3074.4424 3082.8690 3086.0901 3088.7414 3097.8781
redmass: 3.0133 4.8408 3.9127 1.8014 3.4366 1.6185 3.7727 2.6874 1.8462 2.2437 2.6826 3.6671 2.9375 1.0794 1.1338 1.2383 3.5036 2.6408 3.0459 3.8929 2.9816 2.9896 3.1348 3.6352 3.2791 6.0532 1.0636 1.0806 1.1094 1.1661 4.6407 1.2099 4.0625 1.9414 1.1927 1.2268 3.1499 1.4326 4.5185 1.1179 3.6072 3.2089 2.4754 2.3152 2.3155 1.7487 2.9184 2.7964 2.9929 1.4546 1.8644 1.6525 1.2895 1.3767 1.2508 1.2920 1.1081 1.0578 1.1236 1.0951 1.3172 1.3228 1.4492 1.5420 1.6236 1.6036 1.3671 1.3629 1.2182 1.2176 1.0734 1.0753 1.0458 1.0690 1.0808 1.0488 1.0766 1.0435 1.0511 1.0794 1.0855 1.0926 1.0620 9.2740 1.0590 1.0589 1.0592 1.0591 1.0582 1.0371 1.0342 1.0970 1.0355 1.0597 1.0992 1.0566 1.1021 1.1040 1.0853 1.1042 1.1046 1.1007 1.0992 1.1078 1.1008 1.1002 1.1009 1.0996
irintensity: 0.3961 0.7265 0.2606 0.4974 0.0403 0.2287 0.5907 0.0559 0.4732 0.0377 0.3721 0.7740 1.7704 0.1996 0.0050 2.3568 4.6394 2.5538 4.6399 8.8167 2.0263 2.3514 1.2437 1.5956 0.5311 3.4145 15.0486 0.1072 3.7861 0.2690 13.1459 0.4797 7.7672 9.0220 5.8121 1.2606 14.1029 1.0525 1.3659 0.0535 4.1228 0.2005 2.6611 15.4484 57.4675 97.1163 212.2990 146.3854 1.0316 1.8503 9.4510 0.0135 8.0665 0.7901 0.0168 0.6298 0.3343 0.5000 0.0502 0.1242 4.0022 0.9956 25.2008 21.2673 0.7362 0.1621 7.7341 10.0871 11.7766 26.6746 0.0439 0.0224 7.1707 0.3116 0.0817 1.1854 3.6893 12.2872 16.4813 0.5139 4.2156 21.4393 33.9880 165.2759 0.1341 1.7776 0.2454 27.1650 146.8898 33.0459 28.7447 0.0657 28.8079 18.4886 0.5114 41.5377 1.1155 0.0957 6.3843 65.1115 55.4802 88.8813 54.5156 85.3629 21.3326 38.0362 22.6135 43.7527
temp: 298.150 k
press: 1.00000 atm
elementType: 8 8 6 6 6 6 6 6 6 6 6 6 6 6 1 1 1 1 1 1 1 1 1 1 1 1 1 1 1 1 1 1 1 1 1 1 1 1
symmnumber: 1
zpe: 888940.3 jmol-1
zpe.correction: 0.338579 hartree
zpe.thermalcorrener: 0.357220 hartree
zpe.thermalcorrenthalpy: 0.358164 hartree
zpe.thermalcorrgfe: 0.288491 hartree
zpe.sumelectzpe: -620.968062 hartree
zpe.sumelectthermal: -620.949421 hartree
zpe.sumelectthermalent: -620.948477 hartree
zpe.sumelectthermalfe: -621.018150 hartree
dipole: -1.2153 -1.5551 0.4432
dipole: 2.0228
quadrupole: -88.4038 -93.2184 -87.6635
quadrupole: -9.6553 2.9662 2.5566
quadrupole: 1.3581 -3.4565 2.0984 -9.6553 2.9662 2.5566
hfenergy: -621.3066413 hartree
pointgroup: C01 [X(C12H24O2)]
dipole: 0.4812112 -0.5994758 -0.2059125 debye
polarizability: 184.9795783|0.4358377|120.8901102|0.1771785|2.0898205|112.6315416 unknown
InChI: InChI=1S/C12H24O2/c1-4-5-6-7-8-9-10-14-12(13)11(2)3/h11H,4-10H2,1-3H3
charge 0 multiplicity 1
38 atoms
O  -2.429979 -0.279015 -0.198394
O  -3.805944 1.423713 0.599912
C  2.579725 -0.336852 -0.172523
C  3.887751 0.405125 0.183367
C  1.308782 0.462611 0.192925
C  5.16114 -0.391699 -0.179546
C  0.004605 -0.285154 -0.171999
C  6.469369 0.351995 0.174698
C  -1.235215 0.526134 0.203275
C  7.736861 -0.450763 -0.190404
C  -4.812628 -0.647817 -0.320496
C  -3.677309 0.294109 0.071927
C  -5.316268 -1.377257 0.957167
C  -5.953429 0.141323 -1.002832
H  2.559772 -1.316184 0.349336
H  2.570562 -0.563114 -1.259161
H  3.895982 0.632929 1.270006
H  3.90738 1.384391 -0.339251
H  1.332512 1.443221 -0.326464
H  1.317967 0.685425 1.28032
H  5.154605 -0.620967 -1.265915
H  5.144708 -1.370476 0.344195
H  -0.015488 -0.498343 -1.258199
H  -0.027447 -1.261841 0.348241
H  6.485315 1.329664 -0.348927
H  6.475096 0.58101 1.260079
H  -1.275488 1.497858 -0.32327
H  -1.294754 0.723275 1.290091
H  8.657515 0.100293 0.07624
H  7.757664 -1.421018 0.34106
H  7.772422 -0.663216 -1.275742
H  -4.39841 -1.399446 -1.016245
H  -6.126611 -2.079542 0.691232
H  -5.712882 -0.648051 1.686231
H  -4.505404 -1.951355 1.439927
H  -6.798364 -0.533288 -1.230011
H  -5.617399 0.60466 -1.947799
H  -6.312614 0.946262 -0.338052
