program: Orca
programVersion: 5.0.4
elementType: O N N C C C C C C C C C C C C C C C C C C C C C C H H H H H H H H H H H H H H H H H H H H H H H H H H H H H
charge: 1
multiplicity: 1
keywords: DLPNO-CCSD(T) def2-TZVP def2-TZVP/C VeryTightSCF
formula: C22H29N2O
InChI: InChI=1/C22H29N2O/c1-3-22(25)24(20-12-8-5-9-13-20)21-14-15-23(16-18(21)2)17-19-10-6-4-7-11-19/h4-13,18,21,23H,3,14-17H2,1-2H3
54 atoms
O  -0.167512 -0.709604 -1.117565
N  -1.665625 1.270023 -0.312084
N  1.694914 0.056257 -0.082638
C  1.019478 1.189287 0.588803
C  0.596643 2.363729 -0.318352
C  -0.138163 0.746352 1.522115
C  -0.742347 2.185898 -1.04433
C  -1.480337 1.375057 1.159831
C  1.673048 2.768146 -1.318782
C  -3.083081 1.402015 -0.769345
C  3.077205 -0.145238 0.28486
C  1.03672 -0.83836 -0.853451
C  -3.930895 0.275826 -0.244279
C  1.765274 -2.059027 -1.360999
C  4.09633 0.258656 -0.5668
C  3.373237 -0.712425 1.517733
C  -3.687395 -1.030948 -0.665117
C  -4.947448 0.525756 0.6714
C  1.513299 -3.242561 -0.418346
C  5.420139 0.079677 -0.186556
C  4.698197 -0.881735 1.898161
C  -4.451145 -2.075738 -0.165865
C  -5.717327 -0.520502 1.165383
C  5.721893 -0.488106 1.045338
C  -5.466982 -1.82106 0.749409
H  1.809073 1.599745 1.215798
H  0.468772 3.194103 0.384576
H  0.095493 1.013956 2.55375
H  -0.237394 -0.339494 1.492063
H  -1.240672 3.150698 -1.159366
H  -0.601409 1.746243 -2.032427
H  -1.543481 2.431006 1.430985
H  -2.300735 0.844399 1.640525
H  1.839469 1.973919 -2.049738
H  2.617847 2.97523 -0.813149
H  1.377252 3.668824 -1.861566
H  -3.051444 1.403506 -1.860942
H  -3.448843 2.373723 -0.432285
H  1.347491 -2.273743 -2.345556
H  2.833429 -1.881106 -1.466647
H  3.85396 0.699182 -1.526656
H  2.567798 -1.023517 2.174819
H  -2.900486 -1.236741 -1.385482
H  -5.146047 1.542665 0.996133
H  0.442484 -3.415437 -0.294216
H  1.957356 -3.066493 0.563766
H  1.960079 -4.148131 -0.830305
H  6.216966 0.38717 -0.853853
H  4.930061 -1.326732 2.858862
H  -4.26091 -3.089759 -0.49824
H  -6.512622 -0.318062 1.873394
H  6.755725 -0.623983 1.340764
H  -6.067192 -2.637982 1.133283
H  -1.293005 0.327084 -0.578554
totalener: -1033.94247347 hartree
nucrepener: 2275.84530440 hartree
electener: -3309.78777787 hartree
oneelecener: -5907.21856262 hartree
twoeener: 2597.43078475 hartree
kineticenergy: 1033.04085709 hartree
chargesum: 1.0000000
charge: -0.649989 0.095984 -0.137668 -0.026472 0.100962 -0.214104 -0.304216 -0.242875 -0.402920 -0.174127 0.163577 0.477754 0.155606 -0.107566 -0.305603 -0.344722 -0.257197 -0.231694 -0.383977 -0.045912 -0.046050 -0.113542 -0.112764 -0.127674 -0.124257 0.159397 0.098778 0.151191 0.140750 0.158695 0.157484 0.152300 0.187722 0.115005 0.146554 0.146637 0.178783 0.160075 0.132000 0.133872 0.147450 0.141978 0.157840 0.138540 0.126989 0.113493 0.141432 0.150214 0.149641 0.148641 0.150676 0.151557 0.150988 0.270765
charge: -0.032381 0.233198 0.241700 -0.180216 -0.240621 -0.200090 -0.176025 -0.190997 -0.243131 -0.154573 -0.173320 -0.317835 -0.173327 -0.207682 -0.108572 -0.108828 -0.106210 -0.109633 -0.261666 -0.113867 -0.113794 -0.116452 -0.116670 -0.111949 -0.109701 0.166071 0.158124 0.144033 0.145911 0.140628 0.144547 0.137572 0.148051 0.117376 0.125348 0.124622 0.149146 0.144401 0.147718 0.144061 0.147131 0.146432 0.149161 0.146171 0.118988 0.114403 0.123410 0.148955 0.148765 0.147755 0.148327 0.149123 0.148652 0.217759
qa: -0.6500 0.0960 -0.1377 -0.0265 0.1010 -0.2141 -0.3042 -0.2429 -0.4029 -0.1741 0.1636 0.4778 0.1556 -0.1076 -0.3056 -0.3447 -0.2572 -0.2317 -0.3840 -0.0459 -0.0461 -0.1135 -0.1128 -0.1277 -0.1243 0.1594 0.0988 0.1512 0.1407 0.1587 0.1575 0.1523 0.1877 0.1150 0.1466 0.1466 0.1788 0.1601 0.1320 0.1339 0.1475 0.1420 0.1578 0.1385 0.1270 0.1135 0.1414 0.1502 0.1496 0.1486 0.1507 0.1516 0.1510 0.2708
va: 1.7731 3.3578 2.8007 3.8526 3.7838 3.8775 3.9895 3.9891 3.9650 3.7440 3.6386 3.9374 3.5640 3.8389 4.0952 4.1442 4.0041 4.0043 3.9317 3.9016 3.9059 3.9503 3.9648 3.9824 3.9868 0.9517 0.9753 0.9692 0.9827 0.9621 0.9671 0.9665 0.9584 0.9724 0.9675 0.9670 0.9540 0.9669 0.9751 0.9621 0.9725 0.9795 0.9794 0.9715 0.9751 0.9744 0.9701 0.9697 0.9702 0.9685 0.9683 0.9692 0.9678 0.9944
e0: -1033.942473471 hartree
corrType: DLPNO BASED
energy: -1038.420784593837 hartree
dipole: 1.96071 -2.21115 -0.25044 3.42403 -2.09443 1.32960 -1.02070 1.35109 0.33039
magnitude: 1.39273 au
magnitude: 3.54005 debye
