program: Orca
programVersion: 5.0.4
elementType: O N N C C C C C C C C C C C C C C C C C C C C C H H H H H H H H H H H H H H H H H H H H H H H H H H H
charge: 1
multiplicity: 1
keywords: DLPNO-CCSD(T) def2-TZVPP def2-TZVPP/C VeryTightSCF
formula: C21H27N2O
InChI: InChI=1/C21H27N2O/c1-18(24)23(20-10-6-3-7-11-20)21-13-16-22(17-14-21)15-12-19-8-4-2-5-9-19/h2-11,21,24H,12-17H2,1H3
51 atoms
O  3.523473 -2.520017 0.493992
N  -1.736075 -1.968397 0.020178
N  2.27991 -0.753949 -0.029141
C  1.075795 -1.647777 -0.13001
C  0.341189 -1.676709 1.207609
C  0.167073 -1.221932 -1.274555
C  -0.931676 -2.510422 1.081078
C  -1.095339 -2.080464 -1.263993
C  -3.163529 -2.19533 0.065867
C  -3.940685 -1.040805 -0.586034
C  2.098307 0.673914 -0.204355
C  3.442027 -1.225871 0.28894
C  -3.414158 0.302606 -0.149152
C  2.25154 1.22615 -1.465911
C  1.750063 1.450298 0.887541
C  4.672679 -0.407271 0.452819
C  -2.735659 1.125974 -1.040215
C  -3.538538 0.722385 1.172189
C  2.051243 2.586458 -1.632555
C  1.547432 2.810156 0.70812
C  1.696567 3.376264 -0.547863
C  -2.175292 2.325427 -0.623774
C  -2.982662 1.919154 1.595081
C  -2.291711 2.723106 0.698652
H  1.464312 -2.64222 -0.344808
H  0.045091 -0.663684 1.485534
H  0.992885 -2.081273 1.985391
H  0.687652 -1.319083 -2.229654
H  -0.141452 -0.183689 -1.149541
H  -0.671253 -3.572493 0.921573
H  -1.485298 -2.453858 2.0179
H  -1.766186 -1.717665 -2.041408
H  -0.851163 -3.127833 -1.51689
H  -3.444607 -2.256553 1.118453
H  -3.463054 -3.148326 -0.394675
H  -3.889693 -1.114362 -1.674039
H  -4.995607 -1.148696 -0.325317
H  2.519487 0.599201 -2.306632
H  1.63709 1.001778 1.865537
H  4.949793 -0.401161 1.509102
H  5.4865 -0.865976 -0.110764
H  4.536559 0.615048 0.120333
H  -2.64728 0.827211 -2.079223
H  -4.079807 0.106342 1.881815
H  2.169673 3.028434 -2.61269
H  1.270926 3.424207 1.554297
H  1.536521 4.437584 -0.683613
H  -1.656718 2.9541 -1.337427
H  -3.099131 2.231778 2.625289
H  -1.868232 3.664472 1.025699
H  4.421515 -2.792412 0.702706
totalener: -994.87388571 hartree
nucrepener: 2160.94623640 hartree
electener: -3155.82012211 hartree
oneelecener: -5627.18376177 hartree
twoeener: 2471.36363966 hartree
kineticenergy: 994.17984279 hartree
chargesum: 1.0000000
charge: -0.320929 -0.187772 -0.074102 0.209928 -0.160704 -0.124561 -0.085918 -0.072996 -0.076177 -0.090691 0.097690 0.491777 0.211704 -0.208871 -0.184677 -0.221591 -0.213431 -0.249728 -0.038428 -0.058018 -0.089306 -0.059679 -0.061432 -0.150300 0.107863 0.058977 0.078685 0.081933 0.054806 0.069642 0.074407 0.074196 0.077505 0.062581 0.076944 0.067796 0.097804 0.116512 0.121046 0.131966 0.117983 0.133648 0.091815 0.092078 0.127379 0.120272 0.127682 0.094789 0.108279 0.093686 0.257937
charge: 0.411041 0.180016 0.340619 -0.048124 -0.000408 0.001917 -0.059000 -0.054556 -0.055382 0.000707 -0.121407 -0.132703 -0.061369 0.004309 0.007206 0.074556 -0.011941 -0.002151 0.013625 0.019576 0.021419 -0.016518 -0.011474 -0.024250 0.030722 0.024872 0.015118 0.017268 0.026801 0.008929 0.021707 0.022564 0.009805 0.016611 0.008507 0.016921 0.026950 0.026422 0.026190 0.044018 0.037585 0.037982 0.015142 0.019780 0.029098 0.029150 0.029757 0.015351 0.018837 0.013076 -0.064874
qa: -0.3209 -0.1878 -0.0741 0.2099 -0.1607 -0.1246 -0.0859 -0.0730 -0.0762 -0.0907 0.0977 0.4918 0.2117 -0.2089 -0.1847 -0.2216 -0.2134 -0.2497 -0.0384 -0.0580 -0.0893 -0.0597 -0.0614 -0.1503 0.1079 0.0590 0.0787 0.0819 0.0548 0.0696 0.0744 0.0742 0.0775 0.0626 0.0769 0.0678 0.0978 0.1165 0.1210 0.1320 0.1180 0.1336 0.0918 0.0921 0.1274 0.1203 0.1277 0.0948 0.1083 0.0937 0.2579
va: 2.1785 2.6988 3.1577 3.6584 3.9776 3.9349 3.9953 3.9989 3.9420 3.7874 3.5364 3.8337 3.5649 4.1160 4.1144 3.9222 3.9974 4.0982 3.9910 4.0105 4.0198 3.9364 3.9600 4.0334 1.0235 1.0339 1.0200 1.0195 1.0420 1.0100 1.0088 1.0071 1.0151 1.0019 1.0080 1.0137 1.0135 1.0187 1.0099 1.0024 1.0050 1.0047 1.0097 1.0126 1.0066 1.0109 1.0056 1.0096 1.0044 1.0104 0.9945
e0: -994.873885713 hartree
corrType: DLPNO BASED
energy: -999.225218269158 hartree
dipole: -2.09994 6.84733 4.74739 -6.38465 5.19783 -1.18682 0.11959 0.19403 0.31362
magnitude: 4.90353 au
magnitude: 12.46379 debye
