program: Orca
programVersion: 5.0.4
elementType: S O O N N C C C C C C C C C C C C C C C C C C C C C C H H H H H H H H H H H H H H H H H H H H H H H H H H H H H H H
charge: 1
multiplicity: 1
keywords: DLPNO-CCSD(T) def2-TZVPP def2-TZVPP/C VeryTightSCF
formula: C22H31N2O2S
InChI: InChI=1/C22H31N2O2S/c1-3-21(25)24(19-8-5-4-6-9-19)22(18-26-2)12-15-23(16-13-22)14-11-20-10-7-17-27-20/h4-10,17,25H,3,11-16,18H2,1-2H3
58 atoms
S  -3.090939 0.771719 -0.437032
O  2.603703 -2.832276 0.032187
O  3.465282 -0.968501 -1.372016
N  -1.649255 -1.761928 0.46776
N  1.985661 0.264335 -0.1240
C  1.128606 -0.913435 0.342827
C  0.145917 -0.435692 1.427368
C  0.339351 -1.417353 -0.87545
C  -0.967319 -1.446123 1.696603
C  -0.764107 -2.389824 -0.483583
C  1.997704 -1.994531 1.000052
C  -2.948106 -2.396345 0.606745
C  1.586326 1.600775 0.274298
C  2.990642 0.157091 -0.967232
C  -3.900625 -1.951248 -0.501273
C  3.720919 1.336574 -1.528617
C  0.639756 2.286956 -0.471007
C  2.142716 2.157475 1.412212
C  -4.260449 -0.496131 -0.452965
C  3.407484 -3.870435 0.584672
C  5.035135 1.568963 -0.775086
C  0.249064 3.552218 -0.065761
C  1.747258 3.425958 1.810415
C  -5.51639 0.029163 -0.452774
C  0.801443 4.121376 1.073441
C  -5.541063 1.451043 -0.44383
C  -4.294918 1.986143 -0.443305
H  0.683101 -0.210331 2.351811
H  -0.342313 0.478789 1.103003
H  -0.133061 -0.552654 -1.343979
H  0.997797 -1.87809 -1.610419
H  -0.585534 -2.347653 2.207672
H  -1.673756 -0.978223 2.38213
H  -1.322699 -2.65255 -1.38155
H  -0.336819 -3.330874 -0.093776
H  1.367735 -2.610653 1.642375
H  2.761669 -1.523894 1.630329
H  -2.867921 -3.492942 0.61258
H  -3.369111 -2.10349 1.569626
H  -3.469631 -2.199108 -1.47558
H  -4.82463 -2.52697 -0.42681
H  3.933476 1.086108 -2.567992
H  3.103662 2.228435 -1.507468
H  0.208545 1.83587 -1.355714
H  2.874532 1.602079 1.985517
H  3.807194 -4.441523 -0.248112
H  2.792178 -4.518432 1.21063
H  4.225643 -3.454429 1.17715
H  4.8527 1.856662 0.26007
H  5.586733 2.375368 -1.253493
H  5.65951 0.676817 -0.788722
H  -0.488626 4.093787 -0.642638
H  2.179128 3.868345 2.698075
H  -6.405175 -0.586918 -0.466247
H  0.493521 5.110024 1.386578
H  -6.44659 2.040049 -0.435413
H  -4.021627 3.029031 -0.42493
H  3.131944 -1.798091 -0.896627
totalener: -1507.49159602 hartree
nucrepener: 2861.84522415 hartree
electener: -4369.33682018 hartree
oneelecener: -7730.60659824 hartree
twoeener: 3361.26977807 hartree
kineticenergy: 1506.72478658 hartree
chargesum: 1.0000000
charge: 0.034216 -0.361688 -0.388815 -0.203954 -0.093700 0.393543 -0.140391 -0.193651 -0.108180 -0.093187 -0.082639 -0.079161 0.152400 0.491886 -0.049060 -0.075568 -0.256135 -0.268996 0.047019 -0.029610 -0.233188 -0.039260 -0.053835 -0.205405 -0.078556 -0.098648 -0.171004 0.102000 0.094194 0.078097 0.096435 0.065299 0.090093 0.088951 0.074649 0.104410 0.107617 0.074898 0.079478 0.063841 0.094427 0.117038 0.103487 0.115672 0.117149 0.105437 0.087652 0.085792 0.071890 0.100501 0.094889 0.123843 0.125503 0.097353 0.126622 0.108629 0.090750 0.298975
charge: 0.712335 0.274009 0.393341 0.167611 0.314591 -0.115934 0.014062 0.003382 -0.063632 -0.058620 -0.064436 -0.056762 -0.126498 -0.144279 -0.036087 0.015386 0.001191 -0.000151 -0.310687 -0.005958 0.047810 0.012403 0.013044 -0.062085 0.019522 -0.066891 -0.278554 0.026318 0.028310 0.026396 0.018180 0.003688 0.026626 0.023704 0.009532 0.024448 0.020114 0.010558 0.022124 0.017319 0.031396 0.041236 0.029887 0.024518 0.022788 0.015545 0.010635 0.006235 0.009449 0.021792 0.015083 0.028154 0.028094 0.014865 0.028915 0.014796 -0.015576 -0.183242
qa: 0.0342 -0.3617 -0.3888 -0.2040 -0.0937 0.3935 -0.1404 -0.1937 -0.1082 -0.0932 -0.0826 -0.0792 0.1524 0.4919 -0.0491 -0.0756 -0.2561 -0.2690 0.0470 -0.0296 -0.2332 -0.0393 -0.0538 -0.2054 -0.0786 -0.0986 -0.1710 0.1020 0.0942 0.0781 0.0964 0.0653 0.0901 0.0890 0.0746 0.1044 0.1076 0.0749 0.0795 0.0638 0.0944 0.1170 0.1035 0.1157 0.1171 0.1054 0.0877 0.0858 0.0719 0.1005 0.0949 0.1238 0.1255 0.0974 0.1266 0.1086 0.0908 0.2990
va: 2.6526 1.8974 2.1319 2.6832 3.0486 3.6158 3.8705 4.0068 3.9922 3.9727 3.9797 3.9305 3.5038 3.9130 3.7754 3.8364 4.1207 4.1472 3.6859 3.8887 3.9556 3.9793 4.0083 4.0494 4.0460 4.0333 4.0707 1.0131 1.0348 1.0272 1.0292 1.0076 1.0107 0.9994 1.0129 0.9980 1.0020 1.0074 1.0104 1.0157 1.0165 1.0135 1.0119 1.0254 1.0161 0.9968 0.9954 0.9903 1.0057 1.0049 1.0072 1.0076 1.0076 1.0180 1.0054 1.0087 1.0180 1.0499
e0: -1507.491596025 hartree
corrType: DLPNO BASED
energy: -1512.523548861622 hartree
dipole: 12.68627 -9.49699 3.18928 -10.96474 10.37729 -0.58746 4.36830 -3.75092 0.61738
magnitude: 3.30117 au
magnitude: 8.39092 debye
