program: Orca
programVersion: 5.0.4
elementType: O O O N N C C C C C C C C C C C C C C C C C C C C C C C C H H H H H H H H H H H H H H H H H H H H H H H H H H H H H H H
charge: 1
multiplicity: 1
keywords: wB97X-D3 def2-TZVPP defgrid3 ESD(ABS)
formula: C24H31N2O3
InChI: InChI=1/C24H31N2O3/c1-3-22(27)26(21-12-8-5-9-13-21)24(23(28)29-2)15-18-25(19-16-24)17-14-20-10-6-4-7-11-20/h4-13,27H,3,14-19H2,1-2H3
60 atoms
O  1.021306 -0.528083 -3.051774
O  0.668072 -2.393935 -1.906679
O  1.535768 -2.787734 0.420762
N  -2.004466 1.055551 -0.871174
N  1.827502 -0.529541 0.149138
C  0.581653 -0.304105 -0.697778
C  -0.664279 -0.740577 0.091708
C  0.427547 1.180005 -1.04733
C  -1.943842 -0.371295 -0.642192
C  -0.912166 1.476753 -1.718294
C  -3.318893 1.526005 -1.298904
C  0.75269 -1.17968 -1.956604
C  2.709354 0.596358 0.391292
C  -4.15777 2.068566 -0.136742
C  2.136166 -1.687204 0.706668
C  3.234106 -1.847137 1.706899
C  -4.373644 1.060819 0.960353
C  3.75871 0.820572 -0.482386
C  2.484723 1.431385 1.474554
C  4.489173 -2.432625 1.048834
C  1.188665 -1.308264 -4.255075
C  4.602915 1.899684 -0.264654
C  3.334018 2.504023 1.687265
C  -5.353757 0.079165 0.842319
C  -3.555322 1.048972 2.085379
C  4.391323 2.73823 0.818342
C  -5.499386 -0.901314 1.811623
C  -3.697964 0.070905 3.059008
C  -4.666676 -0.911992 2.921499
H  -0.671056 -1.807431 0.300096
H  -0.648884 -0.213097 1.047232
H  0.456967 1.750806 -0.121295
H  1.245625 1.521435 -1.678124
H  -2.015157 -0.938863 -1.589653
H  -2.787118 -0.681216 -0.028674
H  -0.971417 2.554766 -1.867443
H  -0.955713 1.01319 -2.71735
H  -3.18394 2.326915 -2.028058
H  -3.867105 0.727576 -1.816601
H  -5.11933 2.400101 -0.5352
H  -3.65501 2.948574 0.267807
H  2.850841 -2.547141 2.450267
H  3.459041 -0.906757 2.199013
H  3.911361 0.161369 -1.328103
H  1.656644 1.239442 2.145803
H  4.919491 -1.736834 0.329085
H  5.237318 -2.627938 1.813954
H  4.266054 -3.371306 0.544187
H  0.270965 -1.850473 -4.469719
H  2.01077 -2.008783 -4.129402
H  1.405457 -0.586877 -5.034522
H  5.42625 2.081865 -0.942149
H  3.16937 3.158338 2.532732
H  -6.012068 0.0822 -0.019558
H  -2.798469 1.816913 2.195808
H  5.051973 3.577981 0.987692
H  -6.270031 -1.654115 1.70488
H  -3.059533 0.08249 3.933896
H  -4.784254 -1.672526 3.682576
H  1.020607 -2.756871 -0.443573
totalener: -1268.30698475 hartree
nucrepener: 2936.32323689 hartree
electener: -4204.63022163 hartree
oneelecener: -7536.49702530 hartree
twoeener: 3331.86680367 hartree
kineticenergy: 1262.56182463 hartree
xcener: -124.654412368596 hartree
chargesum: 1.0000000
charge: -0.227348 -0.353143 -0.249327 -0.132849 0.053267 0.262458 -0.212979 -0.121326 -0.152805 -0.205931 -0.140482 0.249415 0.046830 -0.082491 0.358844 -0.087379 0.114967 -0.290690 -0.288527 -0.260096 -0.130373 -0.047093 -0.040567 -0.196384 -0.220768 -0.110878 -0.108900 -0.122136 -0.131267 0.116382 0.101316 0.110998 0.121500 0.110324 0.126642 0.097274 0.112474 0.086550 0.093224 0.098441 0.077544 0.120975 0.116111 0.140147 0.152995 0.094658 0.112952 0.112150 0.133954 0.127134 0.136937 0.151203 0.152904 0.116427 0.101572 0.153100 0.136778 0.128907 0.136058 0.250329
charge: 0.346117 0.201229 0.452040 0.193840 0.342675 -0.133043 -0.000355 0.001679 -0.070777 -0.075538 -0.060687 -0.411119 -0.135968 -0.011915 -0.202105 0.001493 -0.084071 -0.002552 -0.002793 0.038036 0.012501 0.013346 0.013568 -0.009342 -0.015369 0.020091 -0.010996 -0.021804 -0.016597 0.025611 0.036443 0.037606 0.031669 0.014884 0.036847 0.029817 0.010574 0.022315 0.017884 0.032733 0.029317 0.049098 0.034788 0.028779 0.031674 0.015132 0.027000 0.021682 0.018581 0.015627 0.018272 0.032722 0.033352 0.024588 0.018483 0.033711 0.024184 0.019782 0.022070 -0.166810
qa: -0.2273 -0.3531 -0.2493 -0.1328 0.0533 0.2625 -0.2130 -0.1213 -0.1528 -0.2059 -0.1405 0.2494 0.0468 -0.0825 0.3588 -0.0874 0.1150 -0.2907 -0.2885 -0.2601 -0.1304 -0.0471 -0.0406 -0.1964 -0.2208 -0.1109 -0.1089 -0.1221 -0.1313 0.1164 0.1013 0.1110 0.1215 0.1103 0.1266 0.0973 0.1125 0.0865 0.0932 0.0984 0.0775 0.1210 0.1161 0.1401 0.1530 0.0947 0.1130 0.1122 0.1340 0.1271 0.1369 0.1512 0.1529 0.1164 0.1016 0.1531 0.1368 0.1289 0.1361 0.2503
va: 2.2003 2.1406 2.3105 2.7967 3.0796 3.7570 4.0354 3.8135 3.8819 4.0136 3.9330 4.1808 3.4344 3.8396 3.9728 3.8763 3.5428 4.0657 4.0474 3.9221 3.8402 3.9306 3.9170 3.9693 3.9799 3.9901 3.9536 3.9197 3.9610 1.0264 1.0259 1.0294 1.0211 1.0186 1.0110 1.0046 1.0041 1.0098 1.0029 1.0142 1.0197 1.0108 1.0063 1.0151 1.0106 1.0041 1.0043 1.0051 0.9934 0.9948 0.9922 0.9965 0.9959 1.0131 1.0222 0.9957 0.9985 0.9992 0.9984 1.0976
energy: 42931.5 44159.7 44301.7 46252.7 48708.6 49029.4 49305.0 50624.1 51923.3 53346.6 53569.2 53933.3 54140.3 54668.3 55678.6 cm-1
dispersion: -0.035966243 hartree
energy: -1268.147340696707 hartree
dipole: -0.36641 3.44217 3.07577 1.87337 -2.04375 -0.17038 -2.52386 1.57785 -0.94601
magnitude: 3.22247 au
magnitude: 8.19086 debye
