program: Orca
programVersion: 5.0.4
elementType: O N N C C C C C C C C C C C C C C C C C C C C C C C H H H H H H H H H H H H H H H H H H H H H H H H H H H H H
charge: 1
multiplicity: 1
keywords: wB97X-D3 def2-TZVPP defgrid3 ESD(ABS)
formula: C23H29N2O
InChI: InChI=1/C23H29N2O/c26-23(20-11-12-20)25(21-9-5-2-6-10-21)22-14-17-24(18-15-22)16-13-19-7-3-1-4-8-19/h1-10,20,22,26H,11-18H2
55 atoms
O  2.649071 -0.003669 2.985773
N  1.784718 -0.018003 0.936167
N  -2.260294 -1.087759 1.311131
C  3.98521 0.980872 1.227831
C  5.314053 0.704505 1.9066
C  4.650677 2.013784 2.121504
C  0.546847 -0.674685 1.481893
C  -0.05838 -1.631514 0.463115
C  -0.452081 0.393112 1.922099
C  2.777764 0.304268 1.70994
C  -1.369696 -2.186432 1.014855
C  -1.750239 -0.268017 2.383988
C  -3.673465 -1.412872 1.358168
C  1.814108 0.331058 -0.47138
C  -4.220726 -1.743536 -0.040315
C  2.361181 -0.565968 -1.376958
C  1.263832 1.534038 -0.884506
C  -3.738126 -0.749058 -1.068876
C  2.352654 -0.249038 -2.727966
C  1.254754 1.839675 -2.239774
C  1.7957 0.950142 -3.158676
C  -4.16665 0.576358 -1.029879
C  -2.808555 -1.116053 -2.037124
C  -3.664726 1.513933 -1.921731
C  -2.299438 -0.182007 -2.932366
C  -2.721922 1.139085 -2.873207
H  4.001525 1.164281 0.165057
H  6.171549 0.655548 1.248864
H  5.344384 -0.017145 2.71611
H  5.041956 2.886703 1.616466
H  4.196717 2.2259 3.083192
H  0.869575 -1.247329 2.351963
H  0.640084 -2.443555 0.242114
H  -0.288514 -1.105654 -0.464825
H  -0.690707 1.038508 1.073833
H  -0.022238 1.002431 2.722429
H  -1.819779 -2.829384 0.259065
H  -1.180699 -2.815909 1.904696
H  -1.570862 -0.845623 3.310539
H  -2.479983 0.507976 2.622139
H  -4.192272 -0.528613 1.736586
H  -3.899847 -2.239329 2.051696
H  -5.313058 -1.747147 0.012815
H  -3.925806 -2.752397 -0.339632
H  2.781292 -1.502449 -1.028072
H  0.847208 2.223092 -0.16003
H  2.776838 -0.94215 -3.444818
H  0.82051 2.774041 -2.574556
H  1.784847 1.191377 -4.215191
H  -4.904538 0.87959 -0.292817
H  -2.479389 -2.149512 -2.09664
H  -4.017446 2.538988 -1.881708
H  -1.579449 -0.490681 -3.683264
H  -2.337365 1.869045 -3.577321
H  3.437952 0.229906 3.491235
totalener: -1078.48108662 hartree
nucrepener: 2411.21857486 hartree
electener: -3489.69966149 hartree
oneelecener: -6231.64467275 hartree
twoeener: 2741.94501126 hartree
kineticenergy: 1073.24604460 hartree
xcener: -108.256927705066 hartree
chargesum: 1.0000000
charge: -0.227335 0.035679 -0.116392 -0.151499 -0.083913 -0.081063 0.153366 -0.143709 -0.181283 0.376633 -0.178555 -0.146258 -0.147531 -0.064315 -0.110742 -0.169851 -0.130458 0.166469 -0.071379 -0.117186 -0.092441 -0.230715 -0.235105 -0.094949 -0.103055 -0.165467 0.130471 0.109622 0.074541 0.108613 0.079220 0.110336 0.097663 0.084960 0.086330 0.096530 0.101224 0.104499 0.095189 0.089068 0.088975 0.100876 0.109640 0.085490 0.136622 0.142214 0.150439 0.144513 0.151827 0.111857 0.116582 0.133458 0.124072 0.126759 0.219465
charge: 0.447011 0.360771 0.199116 -0.030746 0.049546 0.052302 -0.067385 -0.008632 -0.012239 -0.186996 -0.069070 -0.073323 -0.071827 -0.131345 -0.010593 0.000866 0.004414 -0.072143 0.011205 0.015632 0.016550 -0.002866 -0.014302 -0.014401 -0.023112 -0.025623 0.041924 0.032697 0.017181 0.031884 0.018647 0.035025 0.025364 0.033542 0.029816 0.022178 0.026859 0.015017 0.013892 0.027761 0.022774 0.014004 0.034341 0.022310 0.031083 0.030024 0.033002 0.033450 0.033440 0.024329 0.019157 0.022625 0.019394 0.018161 -0.072690
qa: -0.2273 0.0357 -0.1164 -0.1515 -0.0839 -0.0811 0.1534 -0.1437 -0.1813 0.3766 -0.1786 -0.1463 -0.1475 -0.0643 -0.1107 -0.1699 -0.1305 0.1665 -0.0714 -0.1172 -0.0924 -0.2307 -0.2351 -0.0949 -0.1031 -0.1655 0.1305 0.1096 0.0745 0.1086 0.0792 0.1103 0.0977 0.0850 0.0863 0.0965 0.1012 0.1045 0.0952 0.0891 0.0890 0.1009 0.1096 0.0855 0.1366 0.1422 0.1504 0.1445 0.1518 0.1119 0.1166 0.1335 0.1241 0.1268 0.2195
va: 2.3082 3.3017 2.8022 3.8400 3.8970 3.8904 3.6597 3.8998 3.9589 3.9473 3.9945 3.9933 3.9290 3.6568 3.7908 4.0298 4.0193 3.5238 3.9505 3.9721 3.9255 4.0445 3.9557 3.9295 3.8980 3.9579 1.0019 1.0261 1.0273 1.0267 1.0276 1.0245 1.0164 1.0310 1.0283 1.0203 1.0135 1.0142 1.0058 1.0117 0.9995 1.0075 1.0129 1.0119 1.0142 1.0055 0.9968 1.0022 0.9949 1.0109 1.0068 0.9970 1.0014 0.9999 1.0378
energy: 41888.8 43832.2 44253.1 48377.8 48723.1 48973.5 49249.8 49834.7 51285.7 51403.1 cm-1
dispersion: -0.031921381 hartree
energy: -1078.322148620342 hartree
dipole: -1.82809 5.99993 4.17184 -2.32296 2.99015 0.66719 6.48298 -4.59855 1.88443
magnitude: 4.62606 au
magnitude: 11.75852 debye
