program: Orca
programVersion: 6.0.1
elementType: O O N N C C C C C C C C C C C C C C C C C C C C C C C C H H H H H H H H H H H H H H H H H H H H H H H H H H H O H H O H H O H H O H O H H H
keywords: B3LYP D3BJ Freq def2-TZVPP def2/J RIJCOSX VeryTightSCF defgrid3 CHELPG xyzfile
charge: 1
multiplicity: 1
formula: C24H37N2O7
InChI: InChI=1/C24H27N2O2.5H2O/c27-24(23-12-7-19-28-23)26(21-10-5-2-6-11-21)22-14-17-25(18-15-22)16-13-20-8-3-1-4-9-20;;;;;/h1-12,19,22,25H,13-18H2;5*1H2
70 atoms
O  1.523251 -1.736435 1.76357
O  4.079369 -2.072317 2.271819
N  -2.464082 -0.403332 0.513666
N  1.827413 -0.212261 0.122915
C  0.376843 0.003949 -0.015309
C  -0.366695 -1.235082 -0.525723
C  -0.282748 0.531225 1.26115
C  -1.837412 -0.917402 -0.746707
C  -1.7554 0.81864 1.016289
C  -3.953375 -0.225023 0.408611
C  -4.429696 0.831965 -0.584073
C  2.658857 0.373184 -0.883464
C  2.30015 -1.054906 1.087943
C  -5.938892 0.87675 -0.581183
C  3.239182 -0.430801 -1.857958
C  2.864382 1.748944 -0.895759
C  3.741032 -1.108716 1.360553
C  -6.67221 0.0604 -1.439786
C  -6.61976 1.7022 0.311286
C  4.0456 0.140824 -2.833339
C  3.663538 2.318341 -1.878389
C  4.861447 -0.394165 1.028768
C  4.2595 1.51441 -2.844355
C  -8.061031 0.068318 -1.408018
C  -8.008454 1.712408 0.345718
C  5.934087 -0.947167 1.775529
C  -8.731678 0.893734 -0.513441
C  5.399754 -1.960169 2.509113
H  0.29222 0.779957 -0.778259
H  -0.260249 -2.045512 0.192577
H  0.059438 -1.564944 -1.473613
H  0.19913 1.452426 1.587114
H  -0.169785 -0.184282 2.070034
H  -2.394186 -1.804382 -1.042712
H  -1.967961 -0.155332 -1.513922
H  -1.891165 1.602751 0.272674
H  -2.252852 1.123178 1.935022
H  -4.301285 0.012711 1.412678
H  -4.358037 -1.200545 0.142444
H  -4.035099 1.811452 -0.313846
H  -4.073234 0.599061 -1.587628
H  3.072816 -1.498897 -1.835291
H  2.418165 2.362306 -0.124571
H  -6.155962 -0.577952 -2.146795
H  -6.062394 2.350207 0.977057
H  4.50428 -0.485995 -3.585369
H  3.830109 3.386605 -1.883299
H  4.92165 0.427847 0.34123
H  4.88734 1.958051 -3.604412
H  -8.618505 -0.564241 -2.085093
H  -8.524892 2.363118 1.037961
H  6.963151 -0.633572 1.765939
H  -9.812548 0.904052 -0.490692
H  5.805215 -2.655893 3.221312
H  1.868708 -2.121774 3.450432
O  -0.982113 -1.914756 4.545265
H  -0.76536 -0.977874 4.689976
H  -1.780206 -2.198661 3.18369
O  1.795906 -2.100462 4.426595
H  2.588626 -2.538482 4.776141
H  -0.102384 -2.330465 4.58744
O  0.610385 0.403914 4.611993
H  1.244271 -0.340256 4.647744
H  0.806811 0.960738 5.369514
O  -2.312455 -2.33741 2.34489
H  -3.030493 -2.933257 2.570485
O  4.16428 -3.403937 5.37782
H  4.067966 -4.359201 5.443136
H  4.522872 -3.12376 6.225589
H  -2.35113 -1.159386 1.245828
totalener: -1572.48942237535516 hartree
nucrepener: 3540.06098197122765 hartree
electener: -5112.55040132800423 hartree
oneelecener: -9162.88546387168935 hartree
twoeener: 4050.33506254368558 hartree
kineticenergy: 1565.85572495100064 hartree
exchangeener: -165.692125849113 hartree
correlationener: -10.014627784229 hartree
xcener: -175.706753633341 hartree
energy: -524.7236 -523.3807 -522.9274 -522.4637 -522.3732 -522.2302 -522.1991 -395.1822 -393.2297 -282.4326 -281.2687 -281.2337 -281.2008 -280.9584 -280.7883 -280.6418 -280.5369 -279.9496 -279.7937 -279.6920 -279.5035 -279.4935 -279.4608 -279.4520 -279.4174 -279.3855 -279.3419 -279.1379 -279.0967 -279.0945 -278.9921 -278.9902 -278.9211 -32.8845 -31.0905 -30.4626 -30.4097 -29.9928 -29.6844 -29.2911 -29.1509 -28.5747 -25.9360 -25.8208 -25.2046 -24.3730 -24.3470 -24.1849 -23.3147 -23.0127 -22.8965 -22.5670 -22.4014 -21.5940 -20.8175 -20.4055 -19.9642 -19.4242 -19.2414 -19.1484 -18.8243 -18.6939 -18.2321 -17.8166 -17.4694 -17.3679 -17.3106 -17.1348 -17.1067 -16.8474 -16.6694 -16.5242 -16.3709 -16.2056 -16.1326 -15.9026 -15.8539 -15.5344 -15.2834 -15.0878 -15.0344 -14.9173 -14.7148 -14.6447 -14.4904 -14.4303 -14.3229 -14.1655 -14.1480 -14.0329 -13.8554 -13.7768 -13.7092 -13.5456 -13.4982 -13.4155 -13.3892 -13.1195 -13.0015 -12.9530 -12.7802 -12.7598 -12.6865 -12.6029 -12.3704 -12.2853 -12.1638 -12.1196 -12.0591 -11.9079 -11.6436 -11.5598 -11.4857 -11.3062 -10.7387 -10.7053 -10.6477 -10.2726 -10.1738 -9.8735 -9.6370 -9.3506 -9.2047 -9.1025 -8.7853 -3.7202 -2.9799 -2.9585 -2.6319 -2.5850 -2.2544 -2.0640 -1.8864 -1.6417 -1.4408 -1.3561 electronvolt
chargesum: 1.0000000
charge: -0.470517 -0.238049 0.144830 -0.069756 0.220504 -0.237501 -0.211589 -0.184680 -0.206445 -0.176215 -0.105211 0.012266 0.318931 0.053635 -0.189321 -0.228581 0.142805 -0.186967 -0.187266 -0.109438 -0.102815 -0.184214 -0.123926 -0.132488 -0.132259 -0.156273 -0.128683 0.008448 0.098899 0.125916 0.107054 0.096805 0.127682 0.135880 0.133984 0.130736 0.144188 0.142682 0.137883 0.100452 0.099758 0.154019 0.153223 0.128539 0.128953 0.156134 0.155977 0.175570 0.158021 0.150055 0.150065 0.165324 0.152898 0.157751 0.259009 -0.425679 0.222581 0.276670 -0.500868 0.234952 0.241046 -0.439099 0.237279 0.196938 -0.465961 0.208797 -0.389523 0.223483 0.222172 0.190533
charge: 0.114887 0.394011 0.440625 0.300369 -0.087464 0.002403 0.000241 0.007093 0.008704 0.004449 -0.009296 -0.143669 -0.374580 -0.079783 0.004255 -0.006011 -0.192451 -0.004875 -0.004313 0.004188 -0.000276 0.000688 0.004753 0.001129 0.001343 -0.034887 0.001950 -0.091827 0.036136 0.028938 0.031148 0.032962 0.022485 0.031435 0.024991 0.024559 0.032943 0.031519 0.030746 0.026367 0.026131 0.025699 0.023244 0.018446 0.018665 0.025515 0.024735 0.021429 0.025215 0.022948 0.022996 0.017505 0.023267 0.004935 -0.179736 0.361104 -0.153183 -0.191422 0.325682 -0.173045 -0.148680 0.283385 -0.163134 -0.133921 0.343137 -0.130271 0.337011 -0.114822 -0.115805 -0.062915
qa: -0.4705 -0.2380 0.1448 -0.0698 0.2205 -0.2375 -0.2116 -0.1847 -0.2064 -0.1762 -0.1052 0.0123 0.3189 0.0536 -0.1893 -0.2286 0.1428 -0.1870 -0.1873 -0.1094 -0.1028 -0.1842 -0.1239 -0.1325 -0.1323 -0.1563 -0.1287 0.0084 0.0989 0.1259 0.1071 0.0968 0.1277 0.1359 0.1340 0.1307 0.1442 0.1427 0.1379 0.1005 0.0998 0.1540 0.1532 0.1285 0.1290 0.1561 0.1560 0.1756 0.1580 0.1501 0.1501 0.1653 0.1529 0.1578 0.2590 -0.4257 0.2226 0.2767 -0.5009 0.2350 0.2410 -0.4391 0.2373 0.1969 -0.4660 0.2088 -0.3895 0.2235 0.2222 0.1905
va: 1.9960 2.3021 3.3853 3.1004 3.5526 3.8030 3.8275 3.8443 3.8635 3.7430 3.7853 3.6108 4.1171 3.6340 4.0244 4.0181 3.6607 3.9831 3.9857 3.9489 3.9256 3.9676 3.9611 3.9874 3.9872 3.9517 3.9686 3.8971 1.0088 1.0453 1.0088 1.0316 1.0508 0.9981 0.9974 0.9973 0.9927 1.0089 1.0037 1.0138 1.0142 1.0039 1.0070 1.0035 1.0033 0.9938 0.9941 0.9915 0.9928 0.9937 0.9937 0.9992 0.9929 1.0326 1.0324 2.0911 1.0726 1.0548 2.0095 1.0705 1.0526 2.0248 1.0546 1.0420 2.0326 1.0345 2.1159 1.0262 1.0272 1.0854
