program: Orca
programVersion: 6.0.1
elementType: O O N N C C C C C C C C C C C C C C C C C C C C C C C C H H H H H H H H H H H H H H H H H H H H H H H H H H H O H H
keywords: DLPNO-CCSD(T) def2-TZVPP def2-TZVPP/C VeryTightSCF xyzfile
charge: 1
multiplicity: 1
formula: C24H29N2O3
InChI: InChI=1/C24H27N2O2.H2O/c27-24(23-12-7-19-28-23)26(21-10-5-2-6-11-21)22-14-17-25(18-15-22)16-13-20-8-3-1-4-9-20;/h1-12,19,22,27H,13-18H2;1H2
58 atoms
O  1.701912 -2.0210 0.797764
O  4.276061 -2.631187 0.9498
N  -2.229211 -0.245057 0.03807
N  2.042587 -0.037317 -0.165617
C  0.56732 0.23941 -0.249243
C  -0.164704 -0.719112 -1.186509
C  -0.112282 0.34099 1.114171
C  -1.629029 -0.289253 -1.283045
C  -1.577917 0.723204 0.901153
C  -3.686586 -0.179323 0.041593
C  -4.323329 1.100578 -0.537916
C  2.888753 0.954182 -0.77617
C  2.548021 -1.122656 0.382272
C  -5.824513 1.02945 -0.469296
C  3.367943 0.742799 -2.061402
C  3.174503 2.122584 -0.082441
C  3.963843 -1.360964 0.532289
C  -6.559215 0.464072 -1.510938
C  -6.507885 1.474793 0.66168
C  4.16842 1.711387 -2.653028
C  3.974754 3.086571 -0.681979
C  5.120607 -0.631118 0.408238
C  4.475038 2.87915 -1.963237
C  -7.941041 0.347357 -1.427065
C  -7.889603 1.360442 0.750617
C  6.182835 -1.491652 0.768765
C  -8.610564 0.794731 -0.294269
C  5.615092 -2.687722 1.083341
H  0.538125 1.229079 -0.704252
H  -0.115051 -1.73585 -0.804626
H  0.29546 -0.695697 -2.176113
H  0.384925 1.097389 1.724363
H  -0.067576 -0.610115 1.638089
H  -2.177592 -1.007208 -1.892814
H  -1.683971 0.683155 -1.802177
H  -1.626852 1.748516 0.495438
H  -2.091509 0.736562 1.862564
H  -4.023524 -0.304162 1.072692
H  -4.060394 -1.04132 -0.514657
H  -3.970027 1.971016 0.018143
H  -4.007742 1.23093 -1.574747
H  3.12455 -0.171495 -2.584296
H  2.785548 2.267512 0.915868
H  -6.045262 0.11974 -2.400399
H  -5.953665 1.923719 1.477266
H  4.548674 1.554805 -3.652594
H  4.207432 3.997302 -0.148425
H  5.207396 0.394002 0.103613
H  5.098055 3.631169 -2.426591
H  -8.495444 -0.087664 -2.247792
H  -8.403778 1.717662 1.632788
H  7.231789 -1.254382 0.789518
H  -9.686532 0.708717 -0.228844
H  6.020468 -3.632213 1.400302
H  2.064814 -2.781644 1.335962
O  2.141739 -4.043216 2.366955
H  2.674736 -4.815592 2.15732
H  1.33135 -4.369522 2.771238
totalener: -1259.46384623699078 hartree
nucrepener: 2660.11042078266973 hartree
electener: -3919.57426701966051 hartree
oneelecener: -6982.26108979103265 hartree
twoeener: 3062.68682277137214 hartree
kineticenergy: 1258.24065877418639 hartree
energy: -565.1973 -564.4125 -563.5707 -428.7704 -425.2493 -314.0680 -311.3372 -311.2007 -310.2475 -310.0631 -309.9762 -309.1800 -309.0725 -309.0715 -308.9272 -308.9118 -308.8537 -308.5645 -308.5414 -308.1642 -308.1280 -308.0685 -307.3288 -307.2323 -307.0579 -307.0548 -307.0114 -307.0102 -306.9342 -44.0561 -43.1923 -40.8379 -38.9035 -36.0606 -34.6903 -33.6607 -32.9869 -32.7312 -31.8553 -31.0993 -31.0550 -30.5080 -30.4156 -29.0345 -28.7561 -27.9817 -26.8236 -26.6150 -26.2381 -25.9307 -25.8324 -25.2331 -25.0929 -24.6223 -23.9767 -23.7442 -23.5790 -23.1534 -22.8284 -22.2205 -22.0031 -21.6549 -21.1835 -21.0324 -20.5752 -20.4381 -20.2601 -20.0387 -19.9316 -19.8322 -19.7769 -19.5079 -19.4143 -19.2784 -19.1631 -19.0718 -18.8279 -18.6782 -18.5936 -18.3070 -17.9874 -17.6425 -17.3640 -17.2458 -17.2149 -17.0793 -16.9082 -16.8953 -16.7045 -16.2793 -15.9307 -15.8699 -15.3555 -15.1944 -14.9895 -14.9343 -14.6669 -14.6339 -14.5631 -12.8737 -12.5529 -12.3424 -11.9204 -10.6036 -10.3043 -1.7901 -0.0777 0.0050 0.1223 0.9882 1.4196 1.4637 1.5016 1.6444 1.8772 1.9289 electronvolt
chargesum: 1.0000000
charge: -0.396563 -0.366262 -0.178438 -0.038201 0.181620 -0.162322 -0.151968 -0.076223 -0.073046 -0.091609 -0.068663 0.125574 0.481083 0.165658 -0.227129 -0.234750 0.211541 -0.205459 -0.205565 -0.049071 -0.046286 -0.081881 -0.082096 -0.080350 -0.080375 -0.149143 -0.117722 0.134259 0.106958 0.078025 0.067288 0.064128 0.075552 0.076708 0.061938 0.060587 0.076535 0.074777 0.075469 0.072471 0.072980 0.117406 0.116103 0.083606 0.083247 0.124250 0.124883 0.145541 0.126661 0.103222 0.103116 0.144489 0.103456 0.146619 0.293922 -0.447681 0.266566 0.264566
charge: 0.394198 0.321855 0.162897 0.317778 -0.052757 0.001139 0.000216 -0.058454 -0.058562 -0.058761 -0.007958 -0.129094 -0.159804 -0.070733 0.008522 0.003929 -0.185798 -0.007689 -0.007896 0.012184 0.009163 0.063021 0.015896 -0.005406 -0.005521 -0.021355 -0.011485 -0.021816 0.037274 0.017627 0.015950 0.014579 0.016036 0.020646 0.006079 0.005887 0.020513 0.017728 0.017952 0.016909 0.017044 0.026075 0.025728 0.015311 0.015189 0.027340 0.027286 0.032106 0.027714 0.017806 0.017760 0.023523 0.016774 0.020075 -0.143304 0.375306 -0.100943 -0.095679
qa: -0.3966 -0.3663 -0.1784 -0.0382 0.1816 -0.1623 -0.1520 -0.0762 -0.0730 -0.0916 -0.0687 0.1256 0.4811 0.1657 -0.2271 -0.2347 0.2115 -0.2055 -0.2056 -0.0491 -0.0463 -0.0819 -0.0821 -0.0803 -0.0804 -0.1491 -0.1177 0.1343 0.1070 0.0780 0.0673 0.0641 0.0756 0.0767 0.0619 0.0606 0.0765 0.0748 0.0755 0.0725 0.0730 0.1174 0.1161 0.0836 0.0832 0.1242 0.1249 0.1455 0.1267 0.1032 0.1031 0.1445 0.1035 0.1466 0.2939 -0.4477 0.2666 0.2646
va: 2.0871 2.1451 2.7527 3.0823 3.6281 3.9322 3.9363 4.0004 4.0002 3.9334 3.7197 3.4589 3.9761 3.5346 4.1524 4.1238 3.4240 4.0638 4.0636 3.9879 3.9738 4.0231 4.0237 4.0020 4.0020 4.0156 4.0444 3.9569 1.0080 1.0389 1.0222 1.0223 1.0363 1.0051 1.0057 1.0059 1.0050 1.0137 1.0138 1.0167 1.0168 1.0197 1.0203 1.0156 1.0156 1.0092 1.0098 0.9993 1.0066 1.0070 1.0070 1.0061 1.0082 1.0000 1.0455 2.0572 0.9891 0.9875
e0: -1259.463846238 hartree
corrType: DLPNO BASED
energy: -1264.790909363488 hartree
dipole: -16.065332440 21.412361551 5.347029111 2.894910946 -4.823014035 -1.928103089 -0.544321101 1.387083500 0.842762399
dipolemethod: SCF
magnitude: 5.746177016 au
magnitude: 14.605621247 debye
