program: Orca
programVersion: 6.0.1
elementType: O O N N C C C C C C C C C C C C C C C C C C C C C C C C H H H H H H H H H H H H H H H H H H H H H H H H H H H O H H O H H O H H O H H
keywords: DLPNO-CCSD(T) def2-TZVPP def2-TZVPP/C VeryTightSCF xyzfile
charge: 1
multiplicity: 1
formula: C24H35N2O6
InChI: InChI=1/C24H26N2O2.H3O.3H2O/c27-24(23-12-7-19-28-23)26(21-10-5-2-6-11-21)22-14-17-25(18-15-22)16-13-20-8-3-1-4-9-20;;;;/h1-12,19,22H,13-18H2;1H3;3*1H2
67 atoms
O  2.219667 -1.837833 0.861257
O  4.797036 -2.28774 0.934481
N  -1.842793 -0.29638 0.512163
N  2.376306 0.174379 -0.127832
C  0.901397 0.365708 -0.106848
C  0.134011 -0.689091 -0.905244
C  0.344637 0.502887 1.311299
C  -1.358531 -0.373776 -0.870394
C  -1.15635 0.768149 1.253169
C  -3.308852 -0.222016 0.610248
C  -3.993502 1.011115 -0.003953
C  3.148754 1.297028 -0.573964
C  2.938047 -0.951844 0.342743
C  -5.484258 0.934167 0.194481
C  3.265905 1.551039 -1.935352
C  3.74446 2.138607 0.357033
C  4.381853 -1.172092 0.252059
C  -6.293537 0.288359 -0.739178
C  -6.077109 1.460207 1.341445
C  4.002021 2.646721 -2.367255
C  4.483034 3.230617 -0.079763
C  5.459038 -0.606415 -0.376366
C  4.614894 3.483432 -1.440518
C  -7.662525 0.170996 -0.533599
C  -7.445681 1.345387 1.551464
C  6.583954 -1.41315 -0.065564
C  -8.242251 0.698579 0.61409
C  6.124019 -2.412243 0.73267
H  0.759434 1.322515 -0.61069
H  0.308939 -1.676489 -0.486962
H  0.479165 -0.695596 -1.94032
H  0.838441 1.330145 1.823429
H  0.536335 -0.408485 1.873075
H  -1.915779 -1.156783 -1.385124
H  -1.548685 0.566525 -1.405972
H  -1.339768 1.749061 0.793627
H  -1.567112 0.802743 2.262554
H  -3.568913 -0.2725 1.669957
H  -3.714327 -1.120958 0.141748
H  -3.60763 1.920123 0.459342
H  -3.767216 1.069407 -1.069393
H  2.797508 0.884447 -2.646443
H  3.640653 1.926623 1.412043
H  -5.850092 -0.117455 -1.640576
H  -5.463901 1.974083 2.072064
H  4.101202 2.8436 -3.4256
H  4.953231 3.883934 0.641883
H  5.458485 0.273881 -0.989918
H  5.190504 4.333698 -1.778709
H  -8.27715 -0.326188 -1.27187
H  -7.89078 1.766351 2.442915
H  7.59869 -1.266203 -0.391069
H  -9.308329 0.612677 0.773352
H  6.597581 -3.246299 1.218711
H  2.530054 -3.193053 1.060611
O  -1.410516 -2.641966 1.883703
H  -2.145783 -2.698712 2.498046
H  -1.528772 -1.797845 1.357654
O  0.093619 -4.785293 1.59172
H  -0.479319 -3.976639 1.67674
H  -0.356643 -5.394737 1.001354
O  4.236432 -5.063923 3.050366
H  4.18113 -4.767852 3.964211
H  4.486296 -5.992797 3.081615
O  2.511988 -4.242768 1.189106
H  1.53067 -4.518725 1.360762
H  3.120821 -4.537638 1.911432
totalener: -1487.68759675560659 hartree
nucrepener: 3296.07601855202802 hartree
electener: -4783.76361530763461 hartree
oneelecener: -8567.89998721224401 hartree
twoeener: 3784.13637190460940 hartree
kineticenergy: 1486.22548708836075 hartree
energy: -564.1673 -563.6094 -563.3221 -562.3653 -561.8096 -561.7274 -427.4336 -425.9701 -312.5387 -310.2985 -310.1682 -309.5324 -309.4369 -308.9641 -308.7253 -308.7005 -308.5618 -308.4314 -308.4237 -308.3570 -308.3389 -308.3172 -308.2876 -307.9145 -307.8527 -307.5946 -307.5760 -307.2800 -307.2784 -307.2450 -307.2433 -307.1532 -42.8909 -41.5934 -40.9253 -40.5075 -39.6904 -38.8810 -37.4867 -36.3701 -34.0017 -33.2104 -32.6646 -32.1315 -31.0173 -30.6468 -30.5141 -30.4547 -30.1523 -29.2647 -28.6143 -27.3459 -26.3291 -26.0804 -25.5541 -25.4233 -25.2031 -24.6482 -24.4104 -24.2111 -24.0877 -23.8654 -23.5854 -23.3105 -23.2581 -22.7878 -22.6512 -21.8961 -21.5341 -21.1664 -20.9139 -20.7507 -20.7084 -20.3846 -20.2524 -20.0794 -19.9535 -19.5779 -19.4579 -19.3881 -19.3146 -19.1774 -18.9224 -18.8657 -18.8475 -18.7252 -18.5803 -18.4816 -18.3864 -18.2038 -17.9001 -17.7374 -17.7015 -17.6633 -17.5266 -17.1941 -17.0936 -17.0715 -16.8874 -16.6929 -16.5404 -16.4078 -16.2606 -16.1948 -16.1051 -15.7016 -15.3761 -15.2747 -15.2281 -15.0912 -14.8899 -14.8660 -13.9499 -13.6053 -12.7041 -12.1276 -11.9217 -11.5312 -10.8292 -10.5840 -0.5178 0.3053 0.5712 0.5995 0.9376 1.3226 1.5826 1.6437 1.6884 1.8072 1.9669 electronvolt
chargesum: 1.0000000
charge: -0.604537 -0.358637 -0.151697 -0.086233 0.222876 -0.174121 -0.184588 -0.095465 -0.106368 -0.129882 -0.058420 0.131447 0.477830 0.162246 -0.239843 -0.231344 0.210408 -0.209004 -0.209170 -0.045305 -0.053349 -0.106490 -0.088320 -0.082002 -0.082077 -0.148236 -0.114846 0.106060 0.097527 0.072338 0.073162 0.075680 0.083117 0.085530 0.073199 0.075522 0.084802 0.077699 0.091085 0.079227 0.078763 0.110182 0.111706 0.086405 0.086658 0.118575 0.117477 0.136841 0.120033 0.105622 0.105781 0.133415 0.106014 0.134247 0.348420 -0.563818 0.244858 0.306441 -0.516932 0.326813 0.252785 -0.468845 0.268537 0.269574 -0.396945 0.336416 0.321156
charge: 0.132366 0.320614 0.204063 0.285096 -0.063322 0.001664 0.001752 -0.050074 -0.050457 -0.055691 -0.004247 -0.132763 -0.265470 -0.072024 0.000618 0.005694 -0.177457 -0.007489 -0.007929 0.002759 0.005590 0.033266 0.007592 -0.003726 -0.003843 -0.034166 -0.008830 -0.048675 0.034094 0.014336 0.017618 0.018256 0.018754 0.020568 0.010893 0.010968 0.020209 0.016221 0.018680 0.019173 0.019153 0.023484 0.023869 0.015862 0.015810 0.024262 0.024302 0.026130 0.024494 0.018668 0.018668 0.017832 0.017849 0.012891 -0.164037 0.310497 -0.128792 -0.160546 0.388225 -0.164216 -0.112459 0.358058 -0.100454 -0.099685 0.623620 -0.145431 -0.122736
qa: -0.6045 -0.3586 -0.1517 -0.0862 0.2229 -0.1741 -0.1846 -0.0955 -0.1064 -0.1299 -0.0584 0.1314 0.4778 0.1622 -0.2398 -0.2313 0.2104 -0.2090 -0.2092 -0.0453 -0.0533 -0.1065 -0.0883 -0.0820 -0.0821 -0.1482 -0.1148 0.1061 0.0975 0.0723 0.0732 0.0757 0.0831 0.0855 0.0732 0.0755 0.0848 0.0777 0.0911 0.0792 0.0788 0.1102 0.1117 0.0864 0.0867 0.1186 0.1175 0.1368 0.1200 0.1056 0.1058 0.1334 0.1060 0.1342 0.3484 -0.5638 0.2449 0.3064 -0.5169 0.3268 0.2528 -0.4688 0.2685 0.2696 -0.3969 0.3364 0.3212
va: 1.8219 2.1458 2.7705 2.9829 3.6149 3.9437 3.9087 3.9677 3.9786 3.9096 3.7465 3.5181 4.0136 3.5335 4.1233 4.1527 3.4435 4.0628 4.0598 3.9661 3.9851 4.0121 4.0260 4.0052 4.0052 3.9993 4.0446 3.9546 1.0119 1.0385 1.0219 1.0206 1.0468 1.0041 1.0045 1.0053 1.0046 1.0126 1.0129 1.0177 1.0177 1.0222 1.0201 1.0155 1.0155 1.0099 1.0096 1.0002 1.0074 1.0069 1.0069 1.0086 1.0078 1.0089 1.0069 1.9041 1.0049 1.0208 2.0005 0.9980 0.9992 2.0317 0.9863 0.9852 2.1935 1.0106 0.9985
e0: -1487.687596756 hartree
corrType: DLPNO BASED
energy: -1493.869071701901 hartree
dipole: -17.009780709 20.088764227 3.078983517 -5.242615287 2.914291965 -2.328323322 4.035954149 -2.980479005 1.055475144
dipolemethod: SCF
magnitude: 4.001906642 au
magnitude: 10.172038298 debye
