program: Gaussian 09
title: 000061014
version: EM64L-G09RevD.01
frameworkgroup: C1[X(C15H26O4)]
method: RPBEPBE
basis: SDD
operation: Freq
keyword: #pfreq=noraman
keyword: PBEPBE/SDD
title: #p freq=noraman PBEPBE/SDD
converged: YES YES NO NO
title: Mulliken charges:
elementType: O O O O C C C C C C C C C C C C C C C H H H H H H H H H H H H H H H H H H H H H H H H H H
charge: -0.265486 -0.266041 -0.243961 -0.244827 -0.388012 -0.376103 -0.395981 -0.371437 -0.387916 -0.378757 -0.383474 -0.417468 -0.395290 -0.508568 -0.514655 0.271992 0.269830 -0.269247 -0.269396 0.194798 0.192800 0.188787 0.201366 0.194072 0.192861 0.210422 0.187390 0.195596 0.196818 0.197420 0.209065 0.203579 0.210785 0.208282 0.228961 0.197630 0.235058 0.236456 0.229667 0.236949 0.238427 0.223252 0.250883 0.221696 0.251781
chargesum: 0.00000
title: Mulliken charges with hydrogens summed into heavy atoms:
elementType: O O O O C C C C C C C C C C C C C C C
charge: -0.265486 -0.266041 -0.243961 -0.244827 -0.000414 0.014050 -0.009049 0.026375 0.004497 0.027728 0.030890 0.019775 0.037398 -0.042445 -0.039279 0.271992 0.269830 0.204888 0.204080
polarizability: 2.01225618e+02 -2.38994845e+00 1.73673369e+02 -2.54233299e+00 6.16094202e-01 1.38817569e+02
1716.lowfreq: -10.5265 -6.1698 -0.0003 0.0004 0.0005 1.3048 18.8214 25.1937 30.2099
frequency: 18.3597 25.1899 30.0316 38.9911 69.5138 88.0667 95.7400 109.1474 126.6932 145.8729 151.6727 176.2638 189.1685 198.6099 204.6080 220.7020 249.6109 258.9367 290.9942 326.1362 345.2491 351.6956 398.3307 403.3153 425.6824 445.8569 467.1587 507.6563 558.1083 580.5142 658.3121 694.4938 707.1017 726.2375 756.8396 785.4962 787.3214 793.9678 816.3697 824.9284 859.3672 863.3636 884.1610 906.4940 934.2451 938.8701 949.8877 966.1466 995.4983 1009.6695 1020.6629 1031.1410 1049.5567 1056.5859 1076.4787 1086.0168 1087.6162 1103.7944 1109.3858 1112.8931 1113.6799 1127.0592 1129.7664 1156.2653 1191.2244 1197.2082 1201.2830 1219.4955 1233.8007 1244.1549 1250.4661 1262.5376 1281.1796 1285.8619 1291.5761 1297.1955 1301.1652 1314.3141 1329.5107 1336.5432 1341.4145 1345.1274 1347.5520 1354.7937 1356.7838 1357.3546 1361.6894 1380.5287 1447.3430 1454.3332 1456.4818 1459.8529 1459.8943 1461.5631 1463.2230 1463.9254 1464.5170 1469.2493 1475.8951 1480.4772 1487.3230 1638.8277 1640.0050 2953.6971 2955.5883 2957.4874 2963.7168 2968.4650 2972.7265 2972.9846 2983.5254 2983.9513 2995.0931 2996.6044 3003.2346 3007.4243 3010.5613 3016.6630 3021.2238 3021.8326 3026.2322 3036.8212 3043.3225 3049.1145 3050.8746 3074.5137 3082.0305 3091.3009 3096.0557
redmass: 4.3217 6.5546 8.3103 3.9615 3.8191 3.9206 1.9100 2.6843 3.9694 3.0961 3.1123 4.5103 3.7532 2.7122 2.5022 2.7901 2.6639 2.1070 2.1055 2.3866 2.8515 2.4957 2.8458 2.4342 3.0064 3.0581 2.4347 2.3176 3.7076 4.4639 3.1078 2.7571 1.2287 1.1811 1.3125 2.2986 3.2643 1.8326 2.5617 1.9578 2.9389 2.6660 2.6068 2.1574 2.0456 2.4803 2.0593 1.7244 2.3289 2.2841 2.0707 1.7488 2.6926 2.5451 2.1860 2.3114 1.8229 2.2786 1.8585 2.0507 2.4360 2.8445 1.4135 1.5260 1.4441 1.2712 1.1978 1.4158 1.3695 1.0863 1.2988 1.2919 1.2394 1.2022 1.1666 1.1654 1.2064 1.2991 1.2784 1.3353 1.4052 1.3845 1.4750 1.4469 1.4431 1.5000 1.5580 1.6648 1.0897 1.0776 1.0799 1.0905 1.0828 1.0834 1.0761 1.0914 1.0849 1.0783 1.0918 1.0925 1.0987 9.7221 9.9184 1.0595 1.0597 1.0613 1.0610 1.0612 1.0611 1.0613 1.0637 1.0635 1.0723 1.0907 1.0953 1.0958 1.0586 1.0976 1.0629 1.0614 1.1019 1.1019 1.1026 1.1030 1.1014 1.0947 1.1055 1.1036 1.1003
irintensity: 0.8470 2.0597 1.8336 0.3339 0.0901 0.2401 0.1084 0.3940 1.5891 1.4000 1.3029 3.5585 2.7107 2.9101 4.4441 0.6932 3.4036 6.2082 5.3414 1.2432 0.6590 5.6957 3.1972 1.4680 5.1750 13.7839 0.5408 1.8860 2.7377 4.4307 1.7871 1.3237 8.6998 16.1636 1.0393 4.9992 10.9891 11.3682 3.1460 4.2468 4.4096 9.1088 9.1887 21.8712 7.1303 35.9570 13.4530 9.4695 5.6432 28.5515 16.9338 5.7230 20.1495 7.9319 122.6105 81.4894 18.3076 25.0829 18.7385 10.9871 59.7192 177.0645 16.8658 11.8513 23.7985 76.4624 36.7442 25.5076 3.1567 7.3409 5.2088 5.2215 6.3018 0.3619 0.9766 2.1405 10.8374 19.7439 11.2611 26.2439 4.9704 3.7187 1.4988 0.7663 9.7731 1.7732 0.8363 2.6073 17.2538 4.0886 29.3693 21.7081 10.3425 6.1541 9.9486 11.1687 2.7736 1.2819 3.6330 12.7428 25.0016 284.1996 71.8507 10.3317 20.6447 4.0333 8.6412 71.3343 33.9641 62.3740 29.7551 21.5546 26.2198 1.4097 6.1220 24.4417 1.3992 46.3528 15.0226 41.3914 8.7250 127.2940 87.5758 105.5023 36.8164 25.2325 12.1529 17.7007 21.1234
temp: 298.150 k
press: 1.00000 atm
elementType: 8 8 8 8 6 6 6 6 6 6 6 6 6 6 6 6 6 6 6 1 1 1 1 1 1 1 1 1 1 1 1 1 1 1 1 1 1 1 1 1 1 1 1 1 1
symmnumber: 1
zpe: 1024950.0 jmol-1
zpe.correction: 0.390383 hartree
zpe.thermalcorrener: 0.411209 hartree
zpe.thermalcorrenthalpy: 0.412153 hartree
zpe.thermalcorrgfe: 0.338503 hartree
zpe.sumelectzpe: -886.575113 hartree
zpe.sumelectthermal: -886.554287 hartree
zpe.sumelectthermalent: -886.553343 hartree
zpe.sumelectthermalfe: -886.626993 hartree
dipole: 0.6614 1.2079 0.1903
dipole: 1.3902
quadrupole: -122.8973 -111.9286 -118.5685
quadrupole: 0.5080 12.2955 -3.4246
quadrupole: -5.0992 5.8695 -0.7703 0.5080 12.2955 -3.4246
hfenergy: -886.965496 hartree
pointgroup: C01 [X(C15H26O4)]
dipole: 0.2656396 0.4718112 0.0774585 debye
polarizability: 201.1466493|-2.6588436|173.7148642|-2.8429719|0.9381682|138.8550422 unknown
InChI: InChI=1S/C15H26O4/c16-14-10-8-6-4-2-1-3-5-7-9-11-15(17)19-13-12-18-14/h1-13H2
charge 0 multiplicity 1
45 atoms
O  -2.279902 -1.09707 -0.526286
O  0.451977 -2.078831 0.407981
O  -4.178754 -1.035627 0.822085
O  2.108944 -2.886031 -1.014768
C  1.482646 2.784435 -0.752163
C  0.393315 2.549562 0.319639
C  2.922818 2.876756 -0.184418
C  -1.024794 2.422968 -0.280049
C  3.435667 1.588008 0.508281
C  -2.104995 2.160376 0.793988
C  3.620315 0.385681 -0.449238
C  -3.541719 2.016171 0.236956
C  3.961602 -0.937624 0.280047
C  -3.729513 0.822018 -0.745113
C  2.741724 -1.577268 0.989696
C  -3.465698 -0.505494 -0.061214
C  1.787639 -2.239141 0.008634
C  -1.933113 -2.413017 0.078066
C  -0.555222 -2.801416 -0.419852
H  1.425675 1.974988 -1.507998
H  1.253557 3.724331 -1.29548
H  0.416969 3.380275 1.056221
H  0.614631 1.622217 0.885542
H  2.96413 3.714514 0.542149
H  3.619215 3.142411 -1.006782
H  -1.01947 1.593634 -1.014667
H  -1.276854 3.346988 -0.842271
H  2.743824 1.314282 1.329695
H  4.410603 1.803113 0.992247
H  -2.095509 2.991893 1.527721
H  -1.834638 1.245778 1.361174
H  4.429352 0.624987 -1.168171
H  2.706252 0.234842 -1.057209
H  -3.826304 2.94238 -0.300417
H  -4.254954 1.894029 1.074336
H  4.754048 -0.750316 1.031101
H  4.362547 -1.674122 -0.441147
H  -3.069507 0.925735 -1.620903
H  -4.777817 0.811423 -1.096237
H  2.186027 -0.848335 1.603446
H  3.088438 -2.374584 1.678254
H  -2.688151 -3.152932 -0.246612
H  -1.969133 -2.337764 1.178478
H  -0.387295 -3.887657 -0.297831
H  -0.413973 -2.543761 -1.483411
