program: Gaussian 16
title: Ir(H)2(PhAc)2(IMes)(PPh3) i2
version: ES64L-G16RevC.01
method: RM06L
basis: GenECP
operation: Freq
keyword: #P
keyword: Geom=AllCheck
keyword: Guess=TCheck
keyword: SCRF=Check
keyword: GenChk
keyword: RM06L/GenECPFreq
converged: YES YES NO YES
title: Mulliken charges:
elementType: C C C C C C H C H H H C H H H C C H H C H H H H N N C C H C C H H H C C C H H H H C C H H H Ir H H C P C C C C C C C C C C H C H C H C H C H C H C H H C H H C H H H H H C C C C C H C H C H H H O C H H H
charge: 0.032371 0.022987 0.030150 -0.172325 0.036462 -0.201839 0.107979 -0.240279 0.109021 0.110820 0.142837 -0.261271 0.115214 0.134682 0.138499 -0.035144 -0.020784 0.152213 0.154306 -0.247756 0.134204 0.126346 0.126921 0.105064 -0.346259 -0.346739 -0.171597 -0.159544 0.105570 0.033504 -0.255428 0.128715 0.121352 0.125560 0.041593 0.020835 -0.253109 0.121389 0.137595 0.121668 0.105705 0.007097 -0.253606 0.110672 0.112707 0.142971 0.245711 -0.019331 -0.063372 0.073572 0.530727 -0.228444 -0.210625 -0.228585 -0.120934 -0.106335 -0.110681 -0.109842 -0.073864 -0.080649 -0.112894 0.155571 -0.092736 0.137391 -0.088867 0.136102 -0.094955 0.162563 -0.101854 0.135406 -0.109533 0.148878 -0.111605 0.128970 0.125706 -0.107411 0.123983 0.134117 -0.090663 0.125957 0.118557 0.128155 0.122114 0.127644 0.263261 0.024939 -0.113938 -0.103202 -0.096064 0.129896 -0.097004 0.084430 -0.094002 0.134396 0.132145 0.133502 -0.383319 -0.299282 0.136162 0.155739 0.143076
chargesum: 1.00000
title: Mulliken charges with hydrogens summed into heavy atoms:
elementType: C C C C C C C C C C C N N C C C C C C C C C Ir C P C C C C C C C C C C C C C C C C C C C C C C C C C O C
charge: 0.032371 0.022987 0.030150 -0.067261 0.036462 -0.093860 0.122399 0.127124 0.117069 0.133523 0.139714 -0.346259 -0.346739 -0.066028 -0.053839 0.033504 0.120199 0.041593 0.020835 0.127543 0.007097 0.112744 0.163008 0.073572 0.530727 -0.228444 -0.210625 -0.228585 0.034637 0.031056 0.025421 0.052721 0.061542 0.068229 0.016076 0.032970 0.035116 0.039162 0.024102 0.009024 0.016549 0.014703 0.036981 0.263261 0.024939 0.015958 -0.018772 0.038332 0.035141 0.039499 -0.383319 0.135695
polarizability: 6.57540877e+02 -2.74051740e+01 5.48711998e+02 2.39007040e+01 -4.00502839e+00 5.27642114e+02
1716.lowfreq: -0.0006 -0.0002 0.0004 1.5073 2.2339 3.5760 8.6939 20.9195 23.7459
redmass: 5.1580 4.0903 5.3098 5.1953 5.5074 4.8494 4.8622 4.7179 4.7695 4.2071 4.2854 4.2769 3.2932 4.7097 3.8705 1.7360 3.0622 3.2201 3.9887 4.2605 4.6501 3.6923 1.0494 1.0909 3.8599 5.1680 2.7107 1.1585 1.1631 2.3073 3.9235 1.4526 4.7223 5.8694 1.6305 2.7051 2.9014 2.8123 3.1511 5.4222 5.1104 4.7204 2.8878 3.0374 4.0624 3.7950 5.0159 4.2503 4.7894 2.4854 2.4971 4.6172 3.3714 3.0451 4.0490 5.2681 4.4342 4.9036 2.8408 2.8943 2.8892 3.7320 4.6500 4.1166 3.5890 4.7306 1.6492 3.1417 4.2163 3.2265 3.3610 3.3559 5.2281 3.7450 3.7245 3.1341 6.0552 4.0931 4.5693 3.9205 4.0882 3.4120 2.7564 4.2010 3.1774 4.4792 6.1703 6.3903 6.3747 6.4184 4.5312 5.1719 3.7550 4.5995 1.9160 1.9663 2.0112 2.2217 4.5841 3.6559 1.7372 4.3705 1.8700 3.8138 1.8030 4.5612 1.8794 1.7276 1.2876 1.1068 1.2147 1.2243 1.2385 1.2592 1.2480 1.2516 1.0696 1.2505 1.1105 1.2876 1.2883 1.3216 1.3046 1.3044 3.9172 2.2146 2.1262 2.6925 1.3926 1.4460 2.0481 1.9454 1.4203 1.7502 4.1834 1.2699 1.3011 1.2758 1.2938 3.6238 6.1275 6.1509 5.9160 1.8544 1.7496 1.7508 1.5509 1.5187 1.5644 1.5725 1.5649 1.5779 2.7246 2.5954 1.7902 2.3702 1.5359 2.5724 1.9701 2.0006 1.7757 2.1551 1.6559 2.6135 1.6007 1.5965 2.8141 2.8896 2.8292 2.8542 1.5481 1.0824 1.0818 1.0847 1.0764 1.5185 1.4442 1.1336 1.1313 1.1326 1.1378 2.2665 1.3650 1.3567 6.6391 2.2640 1.5807 1.5463 1.5092 3.6445 1.5065 3.3084 10.9916 6.7755 6.7632 3.7380 4.3945 5.1215 4.1039 2.0598 3.5464 1.2578 1.2467 1.2567 1.2811 1.4663 1.4610 2.7502 1.8801 1.8881 1.0837 1.0872 1.3211 2.1456 1.4155 2.1881 2.0803 1.1793 2.0741 1.0514 1.0559 1.0527 1.0574 1.0780 1.0653 1.0717 1.5766 1.5757 2.0881 2.1116 2.0713 2.3487 2.4580 2.4873 5.1932 5.5234 5.4081 5.5459 5.6320 5.5976 5.7721 7.5219 5.7211 6.0063 7.8317 5.9825 5.9929 8.5151 1.0137 1.0131 1.0522 1.0806 1.0399 1.0391 1.0384 1.0383 1.0384 1.0386 1.0930 1.0987 1.0993 1.0989 1.0984 1.0989 1.0977 1.1027 1.1020 1.1013 1.1007 1.1002 1.1002 1.0905 1.0876 1.0905 1.0903 1.0864 1.0878 1.0906 1.0878 1.0857 1.0857 1.0881 1.0877 1.0893 1.0897 1.1023 1.0939 1.0910 1.0925 1.0944 1.0990 1.0940 1.0990 1.0991 1.0982 1.0901 1.1121
irintensity: 0.1046 0.0037 0.1007 0.2610 0.3598 0.1221 0.2312 0.0620 0.0746 0.2838 0.1610 0.3465 0.6999 0.1814 0.2618 0.4966 0.0295 0.1823 0.2516 1.4261 0.5890 0.6252 0.1248 0.5547 0.1822 0.5662 0.2474 0.2552 0.5263 0.1411 0.2914 0.2087 0.3468 0.1486 1.3227 2.0344 0.0939 4.1128 2.5559 1.5335 5.8775 0.6930 0.0415 0.0428 0.7872 0.9994 0.3911 0.2871 0.1657 0.0173 0.3294 0.5814 0.8248 0.5125 0.0043 2.2108 1.0553 0.0545 0.0321 0.1433 0.1751 0.2292 6.9772 4.1303 4.9604 6.0303 4.7051 8.2230 4.1813 1.2464 0.1619 1.5607 31.5349 24.2407 24.2646 0.2023 121.8221 0.0043 2.0217 0.5690 3.2722 5.8991 11.6709 2.5432 2.6459 14.5192 2.3629 0.3986 0.1438 0.6894 0.4169 0.0002 17.8396 9.2364 63.5125 45.7080 13.0971 11.1562 13.6987 34.0908 4.8012 0.8112 7.3580 3.9386 18.2185 1.3646 9.0135 26.4229 0.1423 7.5846 3.1637 2.8237 1.8615 16.1049 1.8061 14.8710 49.9097 2.3587 9.7864 1.5573 5.3379 0.6040 0.0417 0.2149 24.3428 2.4149 1.8292 3.0148 1.1529 0.7008 3.8436 2.3200 1.7351 4.8639 2.7089 0.2119 0.3816 0.1195 0.0100 1.6818 4.3736 4.1380 2.6362 12.1392 13.5584 0.9620 0.6365 0.5799 9.8471 21.6612 8.4288 4.0723 0.2063 0.3584 1.3416 1.5575 1.1608 0.2897 0.1267 0.2329 1.7404 0.9899 1.4192 7.8309 0.5027 1.9569 24.5427 33.0997 15.4984 3.1781 4.1728 0.2146 0.2118 0.3699 0.5729 1.8529 0.0151 2.2218 3.2368 0.9871 1.3114 41.5140 1.0571 0.3275 19.7990 49.3624 4.8024 11.1704 7.2639 1.7025 1.8008 2.3927 67.3794 6.6358 2.2901 0.1582 0.8373 0.4043 2.5869 42.1320 35.8766 2.4996 5.4354 5.4768 3.6027 7.3501 4.8837 89.9319 1.1121 1.7100 15.0836 11.4561 7.2582 8.6309 2.1457 25.6648 9.5467 5.2941 8.2559 15.6778 0.4278 3.2126 8.5219 3.8401 13.4294 2.0871 10.3188 38.4919 5.1925 3.4669 8.9271 3.1779 110.5980 6.5342 7.0695 19.8734 0.4390 0.0416 1.3650 2.9754 0.6273 3.7352 6.1772 32.4244 7.3937 20.2111 18.0820 98.7662 72.5824 3.6264 8.6163 47.1241 16.9798 19.0845 23.2705 18.5030 18.9900 2.1115 11.1054 7.8300 9.8384 6.9154 10.9363 7.3959 2.4182 8.4897 6.9699 7.8164 9.5862 9.4347 11.6805 13.4206 1.5161 8.2790 13.6583 1.2068 1.5231 9.4267 2.1334 0.0561 0.1917 1.0327 1.4163 2.7580 1.0259 3.4336 7.9678 6.9936 8.2398 13.0218 12.9699 5.2971 16.4757 18.1630 4.5247 5.1658 1.8888
temp: 298.150 k
press: 1.00000 atm
elementType: 6 6 6 6 6 6 1 6 1 1 1 6 1 1 1 6 6 1 1 6 1 1 1 1 7 7 6 6 1 6 6 1 1 1 6 6 6 1 1 1 1 6 6 1 1 1 77 1 1 6 15 6 6 6 6 6 6 6 6 6 6 1 6 1 6 1 6 1 6 1 6 1 6 1 1 6 1 1 6 1 1 1 1 1 6 6 6 6 6 1 6 1 6 1 1 1 8 6 1 1 1
symmnumber: 1
zpe: 2179040.4 jmol-1
zpe.correction: 0.829953 hartree
zpe.thermalcorrener: 0.881816 hartree
zpe.thermalcorrenthalpy: 0.882760 hartree
zpe.thermalcorrgfe: 0.740988 hartree
zpe.sumelectzpe: -2450.349837 hartree
zpe.sumelectthermal: -2450.297973 hartree
zpe.sumelectthermalent: -2450.297029 hartree
zpe.sumelectthermalfe: -2450.438802 hartree
dipole: -3.5754 1.8331 -1.4762
dipole: 4.2805
quadrupole: -246.6598 -267.5769 -285.8083
quadrupole: -1.4467 10.9328 -1.1550
quadrupole: 20.0219 -0.8952 -19.1267 -1.4467 10.9328 -1.1550
hfenergy: -2451.1797894 hartree
pointgroup: C01 [X(C47H49Ir1N2O1P1)]
dipole: -1.2369721 0.7908216 -0.4312662 debye
polarizability: 657.5408767|-27.405174|548.7119978|23.900704|-4.0050284|527.6421139 unknown
InChI: InChI=1/47C.Ir.2N.O.P.49H
charge 1 multiplicity 1
101 atoms
C  -1.36490138 3.86487932 -1.34313748
C  -0.94891587 3.56604397 -0.04054352
C  -1.84235908 3.46757554 1.02976118
C  -3.19809831 3.65242314 0.76042436
C  -3.66392963 3.92374516 -0.52488381
C  -2.73210867 4.02863446 -1.56008937
H  -3.07801899 4.25704176 -2.56599494
C  -5.1252117 4.11121883 -0.79136699
H  -5.41896188 3.6706347 -1.74714923
H  -5.73923325 3.66352909 -0.00808434
H  -5.38396468 5.17374087 -0.83915947
C  -0.37114052 4.00484832 -2.45470915
H  -0.87052996 4.1095737 -3.41899595
H  0.2594298 4.88904545 -2.31788302
H  0.30167109 3.14315292 -2.5047563
C  1.33252816 4.42730538 0.42895733
C  2.54913688 3.87292579 0.62750104
H  1.00483053 5.45355755 0.42390197
H  3.51140393 4.31476184 0.82580788
C  -1.35967224 3.1147696 2.40328845
H  -0.56241343 3.78309972 2.74214669
H  -2.17053296 3.16079443 3.1310799
H  -0.93647411 2.10157363 2.42893455
H  -3.91044661 3.56324729 1.57697833
N  0.4518853 3.37984251 0.20968936
N  2.3864505 2.50307624 0.52757941
C  4.8671058 0.20538494 2.03013776
C  5.16527151 0.22587724 -0.3503794
H  5.15465133 -0.15958314 3.01303716
C  3.81651141 1.11695316 1.9342618
C  3.07648726 1.59407476 3.14509136
H  1.9954624 1.46681031 3.02678913
H  3.38741881 1.0498504 4.03709645
H  3.24940545 2.65908432 3.33163852
C  3.47011456 1.5672124 0.65862617
C  4.12270372 1.13719769 -0.50079841
C  3.68696063 1.61986002 -1.84982122
H  4.33101681 1.22589192 -2.63617458
H  2.65845744 1.30840934 -2.06688415
H  3.70439964 2.71231189 -1.91700293
H  5.68529561 -0.12560428 -1.23789722
C  5.55730198 -0.2444313 0.9039388
C  6.71391985 -1.18669331 1.03847209
H  6.62603227 -1.81431053 1.92780433
H  6.81083683 -1.83623576 0.16583128
H  7.65588292 -0.63637297 1.13024031
Ir 0.35548218 0.24673401 0.07233742
H  1.81861163 -0.12292271 -0.25463653
H  0.90416677 -0.02820408 1.52215769
C  1.08741147 2.17107719 0.26771512
P  -0.1388904 -2.04722918 0.02813474
C  -1.32044265 -2.55282473 -1.27226355
C  1.33468156 -3.09389589 -0.25859327
C  -0.84420429 -2.73558001 1.56796154
C  -0.95076817 -2.35570895 -2.60958561
C  -2.60484137 -3.02145408 -0.98540301
C  1.29374092 -4.24940316 -1.04422766
C  2.52583319 -2.75229265 0.39244387
C  -0.99551748 -4.11814848 1.72301147
C  -1.24538643 -1.88702507 2.60113541
C  -1.84153974 -2.64324714 -3.63601516
H  0.04308417 -1.9813995 -2.84429255
C  -3.49636323 -3.30162536 -2.01650911
H  -2.91330762 -3.16727999 0.04526885
C  2.4274481 -5.04352084 -1.18214427
H  0.37738896 -4.53114787 -1.55412777
C  3.65180635 -3.55388278 0.25816393
H  2.5716603 -1.85716174 1.00712081
C  -1.55098621 -4.63666452 2.88476151
H  -0.67280451 -4.79087556 0.93265096
C  -1.80318842 -2.40796594 3.76440174
H  -1.09922234 -0.81524238 2.49568251
C  -3.11855264 -3.11587981 -3.34123444
H  -1.53572089 -2.50640569 -4.66865216
H  -4.489644 -3.66969247 -1.78029562
C  3.60634599 -4.69863955 -0.53143969
H  2.38616408 -5.93539336 -1.79832617
H  4.56692234 -3.28108938 0.77304378
C  -1.95871675 -3.78175019 3.90565121
H  -1.66147353 -5.70981813 2.99742082
H  -2.10625846 -1.74105958 4.56503045
H  -3.81191775 -3.34626248 -4.14342889
H  4.48795866 -5.32150164 -0.63902118
H  -2.38831586 -4.18931808 4.81453031
C  -1.69803871 0.77222472 -2.30552082
C  -2.78559317 0.46750261 -1.36296735
C  -4.05902238 0.11268026 -1.82889127
C  -2.5652664 0.49106668 0.02234147
C  -5.06413695 -0.24239723 -0.94169511
H  -4.25470089 0.08434779 -2.89529713
C  -3.57027251 0.14318707 0.91149464
H  -1.65106127 0.93219287 0.44148392
C  -4.81961058 -0.23560285 0.42851882
H  -6.03894196 -0.53206739 -1.31844993
H  -3.38875311 0.18910817 1.98017472
H  -5.60653328 -0.51087133 1.12260424
O  -0.51011965 0.75854281 -1.95419394
C  -2.01997366 1.08663894 -3.73140612
H  -2.79236168 1.85640058 -3.80586996
H  -1.11996623 1.40924156 -4.25131538
H  -2.40655603 0.19247517 -4.23109087
