program: Gaussian 16
title: Ir(H)2(PhCO2Me)(IMes)(PPh3)
version: ES64L-G16RevC.01
method: RM06L
basis: GenECP
operation: Freq
keyword: #P
keyword: Geom=AllCheck
keyword: Guess=TCheck
keyword: SCRF=Check
keyword: GenChk
keyword: RM06L/GenECPFreq
converged: YES YES YES YES
title: Mulliken charges:
elementType: C C C C C C H C H H H C H H H C C H H C H H H H N N C C H C C H H H C C C H H H H C C H H H Ir H H C P C C C C C C C C C C H C H C H C H C H C H C H H C H H C H H H H H C C C C C H C H C H H H O O C H H H
charge: 0.023253 0.035374 0.021877 -0.185444 0.024434 -0.168794 0.108260 -0.239273 0.116385 0.105893 0.142956 -0.262759 0.117191 0.141774 0.103217 -0.031552 -0.024533 0.151104 0.153301 -0.250817 0.131560 0.121790 0.146064 0.107052 -0.345250 -0.344954 -0.173639 -0.171353 0.106339 0.032003 -0.257560 0.130372 0.121787 0.125714 0.036896 0.033930 -0.263761 0.117801 0.121574 0.122159 0.101460 0.025187 -0.253451 0.107740 0.124321 0.135498 0.211790 0.034045 -0.038668 0.063140 0.510050 -0.223852 -0.204748 -0.230461 -0.126161 -0.104743 -0.106436 -0.099512 -0.079114 -0.072577 -0.098018 0.148769 -0.091039 0.136482 -0.091049 0.137333 -0.095612 0.153530 -0.100454 0.135338 -0.107662 0.142770 -0.107483 0.122259 0.125780 -0.106774 0.124059 0.121547 -0.091426 0.126338 0.117338 0.127121 0.124925 0.127680 0.507280 -0.055091 -0.087349 -0.103485 -0.088730 0.134653 -0.092324 0.096042 -0.095416 0.134366 0.128623 0.132456 -0.418552 -0.326495 -0.096069 0.126289 0.141135 0.127039
chargesum: 1.00000
title: Mulliken charges with hydrogens summed into heavy atoms:
elementType: C C C C C C C C C C C N N C C C C C C C C C Ir C P C C C C C C C C C C C C C C C C C C C C C C C C C O O C
charge: 0.023253 0.035374 0.021877 -0.078392 0.024434 -0.060534 0.125961 0.099421 0.119552 0.128767 0.148596 -0.345250 -0.344954 -0.067300 -0.069893 0.032003 0.120313 0.036896 0.033930 0.097773 0.025187 0.114108 0.207166 0.063140 0.510050 -0.223852 -0.204748 -0.230461 0.022609 0.031739 0.030897 0.054019 0.056224 0.070193 0.024241 0.034740 0.033011 0.025935 0.025884 0.009676 0.019638 0.018150 0.036253 0.507280 -0.055091 0.047304 -0.007443 0.045636 0.036299 0.037041 -0.418552 -0.326495 0.298394
polarizability: 6.54223191e+02 -2.06056398e+01 5.44649701e+02 6.87782319e+00 7.17412421e+00 5.34076986e+02
1716.lowfreq: -4.0720 -3.3912 -2.1911 -0.0009 -0.0005 0.0005 8.9916 19.5764 21.5391
redmass: 5.3296 5.4382 4.3110 5.1931 4.9306 4.2968 4.9641 5.6103 4.7169 3.8925 4.1808 4.7909 4.8958 4.4970 1.8434 1.7178 3.6407 4.2878 3.9891 3.5632 3.4442 3.0891 1.3759 1.2210 3.1568 3.5286 5.5480 1.1487 2.3186 3.4166 1.5356 1.4315 1.7497 2.3329 2.8906 4.2820 6.6366 2.9022 4.1829 2.8109 2.9047 4.8448 4.6267 2.8934 3.0200 4.5380 4.7603 5.4335 3.7178 4.8640 2.5211 2.5351 4.3999 3.3967 3.1272 4.6583 2.9754 2.2156 2.3660 3.3198 4.7986 2.8420 2.8758 2.7357 3.1316 4.5714 4.4434 5.6105 4.7294 5.7040 4.2454 3.3771 3.4115 5.5227 5.5232 3.2343 3.1516 4.5256 6.1393 4.0862 4.5783 3.8594 4.0220 3.5030 4.3456 3.2928 6.3183 6.3946 6.3773 6.4212 4.3925 5.1822 4.4206 4.1565 3.2028 3.8580 1.9026 1.9739 1.9554 1.9239 5.0613 2.8722 2.0566 4.3718 3.2355 2.0060 1.8201 1.9098 1.0871 3.2450 1.2873 1.2531 1.2051 1.2779 2.3545 1.2742 1.3115 1.2581 1.3148 1.0589 1.2958 1.3003 1.3793 1.3216 1.3106 1.3081 3.8895 2.2362 2.2581 2.5847 1.3925 1.3732 1.3695 3.4441 1.4258 4.3004 6.7905 1.2682 1.2998 1.2725 1.2904 6.1696 6.0717 4.8761 5.4463 1.6893 1.6383 1.5880 1.6172 1.5593 1.5613 1.5766 2.2974 2.3943 2.4398 1.7604 2.7143 1.5955 1.5286 1.8867 1.9831 1.7094 1.6069 1.6065 2.4999 1.6288 1.4978 2.8093 2.9213 2.8607 3.0006 2.5496 1.2870 1.0823 1.0864 1.0833 1.0859 1.5175 1.1459 1.4471 1.1361 1.1355 1.1389 1.8942 2.2099 1.3575 1.3662 7.2377 1.4750 1.5843 1.5071 3.6951 1.4981 3.3170 3.1770 10.3137 6.6580 6.3270 3.8509 4.4235 4.9473 4.2949 8.0910 1.2604 1.2472 1.2471 1.2966 1.4706 1.4718 2.6726 1.8802 1.9456 1.1756 1.1793 2.1670 1.4180 1.4219 2.1586 2.1288 1.0744 1.0574 1.0618 1.0805 1.2632 1.5289 1.0914 1.0715 1.0780 1.0709 1.5862 1.5628 2.0889 2.1083 2.0764 2.4568 2.4343 2.4768 5.1636 5.4407 5.5628 5.6224 5.8975 5.5691 6.5839 6.3854 5.6735 7.8183 6.1349 5.9857 5.9960 10.3485 1.0139 1.0131 1.0401 1.0398 1.0393 1.0381 1.0381 1.0380 1.0306 1.0887 1.0986 1.0991 1.0989 1.0987 1.0999 1.0993 1.1022 1.1020 1.1016 1.0890 1.0997 1.1005 1.1065 1.0877 1.1003 1.0904 1.0906 1.0904 1.0906 1.0876 1.0850 1.0854 1.0868 1.0887 1.0860 1.0898 1.0906 1.0937 1.0936 1.0947 1.0908 1.1064 1.0990 1.0992 1.0966 1.0988 1.0948 1.0902 1.1118
irintensity: 0.0087 0.0642 0.1683 0.1224 0.0887 0.1337 0.1321 0.1049 0.5772 0.0143 0.1002 0.3259 0.5275 0.1447 0.3165 0.1314 0.2617 0.1975 0.1317 0.6986 0.1450 0.2927 0.2570 0.9956 0.5157 0.2738 1.0369 0.7674 0.3864 0.2521 1.5781 0.2808 0.4363 0.1502 0.4275 1.5808 0.1775 2.2780 1.9953 4.6523 3.6794 1.9734 0.6549 0.0723 0.1115 5.2257 0.6469 0.8145 0.0222 0.0419 0.1789 0.2227 0.5639 1.7345 0.8127 1.5664 3.7548 2.5302 3.0907 15.3255 0.0416 0.1999 0.4320 1.0705 0.1124 9.6087 4.0748 7.2535 3.2315 5.7721 4.0796 0.1812 1.3879 26.5941 12.6343 6.3475 1.2861 36.3373 119.5354 0.0872 2.2736 0.9048 4.5344 5.1708 0.6149 2.3331 0.8425 0.2408 0.2353 0.8612 0.2335 0.0098 7.5914 12.8305 6.5672 11.4164 109.2904 20.6725 33.7411 33.8983 14.8084 39.2107 0.3807 0.1450 0.2508 9.7858 10.7761 11.3482 8.9774 4.2335 0.1546 1.2733 4.5683 4.7307 6.3722 11.7270 2.9425 15.7490 34.3581 8.9268 0.1086 0.5530 0.3395 0.8887 0.1137 0.1198 19.8055 4.5462 3.9457 2.8813 1.5343 0.1396 0.5465 3.6710 0.1420 2.3849 23.5487 0.2967 0.2313 0.0663 0.0016 3.2790 3.5514 1.9774 4.3512 8.7192 7.1189 0.1980 0.8116 6.3041 20.0449 5.9632 2.7423 0.5609 0.5945 3.8376 0.6617 0.1827 0.8241 0.0900 0.0551 1.6614 1.4211 0.1381 5.2318 2.2540 7.6464 25.9531 27.4134 19.6845 4.3592 31.4553 0.5064 0.1637 0.6097 0.3249 0.6039 1.2339 2.3826 0.0795 1.7894 2.4321 0.4485 45.7769 45.4714 0.2543 0.6322 13.1566 27.9796 3.1068 6.7765 1.4487 1.2438 4.3009 246.6634 82.0131 9.1220 4.1356 0.4921 0.6765 0.0276 4.9590 7.0988 0.9353 5.8058 5.9704 3.5266 7.0804 3.3957 84.2700 3.4515 3.1169 23.0953 28.8005 9.2704 4.0683 5.2195 21.4269 8.8799 4.6988 21.8645 4.0816 13.2187 9.1628 3.3274 14.3069 1.7054 3.3511 7.6945 18.9520 29.8650 5.2132 2.8258 8.1870 12.6914 101.5511 7.7371 6.1914 0.2953 0.0152 0.8877 12.0517 0.1004 2.1933 0.9992 0.9052 7.5769 21.2345 20.1093 20.0280 315.9605 56.3717 3.3128 15.4167 12.4220 21.8892 16.3686 20.1854 22.0915 20.8375 48.7571 6.7301 2.0972 13.6417 6.5240 11.1593 8.2760 8.1906 7.9209 8.3985 2.6553 10.6313 7.8894 10.7228 5.7825 10.1184 11.2848 8.6287 14.7370 9.0696 1.7182 0.6995 0.2906 0.0831 1.9139 1.1234 3.7154 1.2061 8.6325 11.8119 14.6306 5.3151 6.3950 15.3717 17.6322 6.8525 14.2922 1.1363 5.5003 1.6574
temp: 298.150 k
press: 1.00000 atm
elementType: 6 6 6 6 6 6 1 6 1 1 1 6 1 1 1 6 6 1 1 6 1 1 1 1 7 7 6 6 1 6 6 1 1 1 6 6 6 1 1 1 1 6 6 1 1 1 77 1 1 6 15 6 6 6 6 6 6 6 6 6 6 1 6 1 6 1 6 1 6 1 6 1 6 1 1 6 1 1 6 1 1 1 1 1 6 6 6 6 6 1 6 1 6 1 1 1 8 8 6 1 1 1
symmnumber: 1
zpe: 2191182.4 jmol-1
zpe.correction: 0.834577 hartree
zpe.thermalcorrener: 0.887881 hartree
zpe.thermalcorrenthalpy: 0.888825 hartree
zpe.thermalcorrgfe: 0.742500 hartree
zpe.sumelectzpe: -2525.587258 hartree
zpe.sumelectthermal: -2525.533954 hartree
zpe.sumelectthermalent: -2525.533009 hartree
zpe.sumelectthermalfe: -2525.679335 hartree
dipole: -2.0825 1.8578 -2.6398
dipole: 3.8414
quadrupole: -256.9163 -274.1688 -284.8157
quadrupole: 0.6752 3.0356 0.2647
quadrupole: 15.0506 -2.2019 -12.8488 0.6752 3.0356 0.2647
hfenergy: -2526.4218349 hartree
pointgroup: C01 [X(C47H49Ir1N2O2P1)]
dipole: -0.6469112 0.7038795 -0.7408617 debye
polarizability: 654.2231908|-20.6056398|544.6497009|6.8778232|7.1741242|534.0769858 unknown
InChI: InChI=1/47C.Ir.2N.2O.P.49H
charge 1 multiplicity 1
102 atoms
C  -1.54841283 3.86044627 -0.79438082
C  -0.93309206 3.54213707 0.42158638
C  -1.65831126 3.30504461 1.5948503
C  -3.04802624 3.38663452 1.51884994
C  -3.70650227 3.68672085 0.32587883
C  -2.9401772 3.92340273 -0.81552699
H  -3.43984339 4.14853016 -1.75491811
C  -5.20100385 3.74588094 0.26368431
H  -5.57959219 3.2863405 -0.65282085
H  -5.66150303 3.23879091 1.11351311
H  -5.55655013 4.78099481 0.27101563
C  -0.73917442 4.12815513 -2.02682173
H  -1.35448531 4.04166362 -2.9246464
H  -0.32245298 5.14078119 -2.01832345
H  0.10563426 3.43891788 -2.11541919
C  1.38411303 4.47767487 0.59809674
C  2.62513495 3.93860797 0.57646829
H  1.04869185 5.49645176 0.69874342
H  3.60006903 4.39098958 0.64992941
C  -0.96277055 2.95741639 2.87553075
H  -0.21545407 3.70919804 3.14740329
H  -1.6727245 2.87845295 3.69944393
H  -0.42718344 2.00496024 2.79381887
H  -3.63265908 3.20174683 2.41699512
N  0.4953068 3.42382184 0.46138885
N  2.46630104 2.57170967 0.4267804
C  5.08856971 0.1655822 1.43496514
C  4.97620799 0.23637805 -0.95985689
H  5.51910057 -0.24068143 2.34709234
C  4.08171416 1.12548222 1.53821128
C  3.56122185 1.57822094 2.86668552
H  2.47673371 1.43894716 2.93404314
H  4.02566516 1.02355427 3.68228658
H  3.7514768 2.64210022 3.03998422
C  3.54566425 1.62573964 0.35033803
C  3.96963019 1.19597794 -0.91224026
C  3.31699725 1.71468938 -2.15653558
H  3.83000882 1.35344 -3.04864594
H  2.26991892 1.39205809 -2.2103593
H  3.31195303 2.8087794 -2.19056779
H  5.31937585 -0.11513626 -1.92972535
C  5.54788537 -0.29098915 0.20059363
C  6.62471637 -1.32774173 0.11058883
H  6.92916236 -1.68221056 1.09657367
H  6.29516902 -2.19273584 -0.47232633
H  7.51483208 -0.93318387 -0.38770989
Ir 0.37264412 0.33205991 0.18139879
H  1.8377759 -0.11458098 0.01292291
H  0.74971733 0.1016035 1.68818429
C  1.14744932 2.23169692 0.35183862
P  -0.20003238 -1.94017322 0.17503114
C  -1.14040622 -2.50238622 -1.28800038
C  1.27325797 -3.02884006 0.20157496
C  -1.18773616 -2.50526642 1.60381581
C  -0.54694746 -2.33188551 -2.54639725
C  -2.4437173 -2.99777769 -1.21339686
C  1.33120067 -4.22729713 -0.5160602
C  2.36216258 -2.65990735 1.00033055
C  -1.36689166 -3.8683546 1.86299232
C  -1.78455867 -1.56695624 2.44865861
C  -1.24046084 -2.66302919 -3.70297609
H  0.46701615 -1.94181697 -2.61221915
C  -3.13482434 -3.32907776 -2.3752977
H  -2.92404696 -3.12297117 -0.24778287
C  2.46115735 -5.03535293 -0.44221791
H  0.49587503 -4.53010477 -1.1404467
C  3.48566849 -3.4726133 1.07448133
H  2.33083126 -1.73108256 1.56296143
C  -2.14018795 -4.28106938 2.93988288
H  -0.89446596 -4.60834058 1.22221978
C  -2.56061222 -1.98183843 3.52581254
H  -1.62336807 -0.50637532 2.26745441
C  -2.5376782 -3.16379367 -3.61917862
H  -0.76722049 -2.53863333 -4.6720447
H  -4.14597383 -3.71684947 -2.30458542
C  3.53957256 -4.65969131 0.35065822
H  2.4965295 -5.9611692 -1.00656314
H  4.32284637 -3.17397758 1.69740225
C  -2.74047931 -3.33831714 3.77042278
H  -2.27109245 -5.33986613 3.13574771
H  -3.01573208 -1.24581026 4.18075065
H  -3.07787911 -3.42712697 -4.52243055
H  4.41958192 -5.29186972 0.40574335
H  -3.34023212 -3.66316428 4.61391604
C  -1.38624835 0.74091081 -2.51284123
C  -2.64933909 0.45128007 -1.82326909
C  -3.7802363 0.0464102 -2.5402761
C  -2.71814681 0.54581293 -0.429104
C  -4.94654652 -0.28780635 -1.86727595
H  -3.72518586 -0.02492867 -3.61991803
C  -3.88365038 0.20927586 0.24142877
H  -1.89078199 0.98083569 0.14073018
C  -4.99663357 -0.21774564 -0.47808476
H  -5.81676646 -0.61319204 -2.42673379
H  -3.93216417 0.30148808 1.32124853
H  -5.90931042 -0.4813411 0.04605965
O  -0.28154253 0.80845946 -1.97251456
O  -1.51947291 0.9255453 -3.82158859
C  -0.30020828 1.11216208 -4.55741548
H  0.36815085 0.26312075 -4.40306682
H  -0.5980566 1.1846676 -5.59969758
H  0.20230794 2.02646833 -4.23768943
