program: Gaussian 16
title: PhCO2Me TS
version: ES64L-G16RevC.01
method: RM06L
basis: GenECP
operation: Freq
keyword: #P
keyword: Geom=AllCheck
keyword: Guess=TCheck
keyword: SCRF=Check
keyword: GenChk
keyword: RM06L/GenECPFreq
converged: YES YES NO YES
title: Mulliken charges:
elementType: Ir H P C C H H N N C H C C C C C C H H H H H C O C C C C C C H H C C C C C C H H C H H H C H H H C H H H C H H H C H H H C H H H C C C C H C H C H H H C C C H C H C H H H C C C C H C H C H H H C O C H H H
charge: 0.436297 -0.134108 0.645717 -0.021623 -0.034753 0.156305 0.153679 -0.342854 -0.344587 0.097577 -0.034928 0.005308 -0.283455 -0.148924 -0.086154 -0.107724 -0.091583 0.059079 0.128373 0.126610 0.129583 0.134790 0.534702 -0.435398 0.042359 0.046081 0.023431 -0.178795 -0.175706 0.027916 0.104752 0.102655 0.040718 0.029994 0.037596 -0.167483 -0.164349 0.000911 0.105587 0.108018 -0.254501 0.136410 0.120892 0.121064 -0.258196 0.144714 0.110424 0.115980 -0.254807 0.121880 0.129361 0.123308 -0.267062 0.129900 0.133452 0.116877 -0.249096 0.123332 0.138254 0.115710 -0.244960 0.142584 0.111687 0.110145 -0.243703 -0.122984 -0.131670 -0.112250 0.149603 -0.082088 0.145497 -0.110648 0.129959 0.126206 0.128691 -0.093476 -0.094582 -0.090428 0.131385 -0.095225 0.153187 -0.107500 0.124651 0.142345 0.122212 -0.204494 -0.096435 -0.125487 -0.089426 0.135087 -0.105582 0.166398 -0.095035 0.126115 0.121348 0.127970 -0.237977 -0.331285 -0.105543 0.138995 0.128610 0.134595
chargesum: 1.00000
title: Mulliken charges with hydrogens summed into heavy atoms:
elementType: Ir P C C N N C C C C C C C C O C C C C C C C C C C C C C C C C C C C C C C C C C C C C C C C C C C C C O C
charge: 0.326340 0.645717 0.134683 0.118926 -0.342854 -0.344587 0.097577 0.005308 -0.283455 -0.020551 0.040456 0.021858 0.043207 0.534702 -0.435398 0.042359 0.046081 0.023431 -0.074044 -0.073051 0.027916 0.040718 0.029994 0.037596 -0.061896 -0.056331 0.000911 0.123864 0.112922 0.119742 0.113166 0.128201 0.119456 -0.243703 0.026618 0.013827 0.017709 0.044118 0.018043 0.037908 0.058605 0.034223 0.047120 0.014712 -0.204494 0.038653 0.040912 0.036690 0.015765 0.032935 -0.237977 -0.331285 0.296657
polarizability: 6.70370843e+02 1.37700224e+01 5.25399914e+02 2.08224339e+01 -7.25285817e-01 5.38289657e+02
1716.lowfreq: -640.8713 -2.6373 -2.1737 -0.0008 0.0007 0.0010 1.2702 4.9117 13.5001
redmass: 1.0766 5.2205 4.6738 4.3954 4.6342 5.2817 1.1741 4.5246 3.4658 4.4755 4.6950 5.0115 4.3707 4.5622 4.3257 4.5045 3.9521 4.2653 1.8268 3.6418 1.4860 3.2467 2.8392 1.1783 1.4089 3.9854 1.3734 1.0700 3.0695 2.8292 3.9061 3.6126 3.6419 4.1108 5.1014 1.6347 4.6212 2.8670 4.6031 2.9842 4.6628 4.7820 4.8791 2.9397 5.2357 4.5595 3.1090 4.7885 5.1645 5.5733 4.4922 2.4871 2.4798 4.6097 3.4673 3.0109 4.5735 4.0808 4.5505 4.9261 2.8781 2.9243 3.0240 5.3080 4.8511 4.6406 5.4287 3.6442 5.6387 4.1531 3.9765 3.3652 3.4496 6.1213 5.7270 3.2570 4.5412 3.1733 5.8749 4.0381 3.7000 3.8149 3.9750 3.4223 3.5988 2.9618 1.6475 6.3235 6.3775 6.2993 5.6463 4.1793 5.0150 5.7311 5.6319 2.4690 2.4706 2.8249 2.1433 2.9874 2.9220 3.7908 1.6741 1.6310 3.4155 1.8480 2.5770 1.7306 1.6646 1.8209 2.8078 1.2922 1.1264 1.3726 2.6247 1.2583 1.2687 1.2599 1.2392 1.1758 1.2823 1.2958 1.2984 1.1198 1.2846 1.3000 1.3045 4.0600 2.1165 2.1406 2.6760 1.3702 1.3719 3.7756 1.4001 1.3977 5.8714 4.1857 1.3000 1.2694 1.2839 1.2741 6.1328 6.1063 6.2357 6.9549 1.7674 1.7518 1.5154 1.5326 1.5605 1.5631 1.5654 1.6017 1.5445 2.7309 2.5908 2.8304 1.5580 1.9517 2.0129 2.2640 1.8068 1.6391 2.7026 1.5670 1.6065 2.7058 2.7931 2.9125 1.9408 2.6559 1.2852 1.8163 1.0821 1.0831 1.1016 1.0828 1.5262 1.4434 1.1326 1.1381 1.1349 1.9566 2.2014 1.3547 1.3571 1.5165 6.8776 1.6236 1.5433 3.5932 1.4989 3.2300 5.0236 8.7129 6.7753 3.5882 6.6314 4.7621 4.6928 3.6369 3.6712 1.2609 1.2523 1.2523 1.2946 1.4748 1.4800 2.6536 1.8393 1.8844 1.9887 1.0671 2.1456 1.5347 1.2722 1.6111 2.1884 1.1987 1.9171 1.0863 1.0604 1.0549 1.0698 1.0686 1.0643 1.0690 1.0633 2.4880 1.6136 1.5708 2.0945 2.0822 2.0871 2.4611 2.4637 5.3414 5.1885 5.3593 5.6141 5.5718 6.0375 5.6905 5.5782 5.6568 7.7976 7.8711 8.3970 6.0070 6.0377 1.0150 1.0145 1.0113 1.0398 1.0391 1.0383 1.0395 1.0384 1.0382 1.0303 1.0989 1.0992 1.0991 1.0975 1.0986 1.0988 1.1026 1.1023 1.1013 1.1011 1.1003 1.1001 1.1067 1.0906 1.0906 1.0904 1.0871 1.0906 1.0870 1.0856 1.0858 1.0866 1.0860 1.0859 1.0899 1.0889 1.0902 1.0927 1.0898 1.0946 1.0947 1.0942 1.1070 1.0992 1.0982 1.0992 1.0993 1.0903 1.1123
irintensity: 168.1647 0.0405 0.0873 0.0549 0.1667 0.1655 0.0854 0.1377 0.1078 0.0281 0.4066 0.9259 0.3048 0.2315 0.5107 0.3791 0.1910 0.0793 0.7575 0.4678 0.2835 0.7693 0.0724 0.0460 0.6392 1.2822 0.4830 0.3041 1.5795 0.1711 0.7843 0.1248 1.6245 2.9240 0.1196 0.4370 1.0079 4.9595 0.9575 0.3466 2.6412 2.9984 0.7017 0.0736 1.2394 1.9445 0.2323 1.4983 0.1097 0.7780 0.4151 0.1439 0.2076 0.0142 0.3386 0.7801 3.8730 0.6825 9.3997 0.4000 0.0348 0.4999 0.4182 11.7068 4.6763 5.0368 4.8140 1.4296 8.8017 2.4527 0.8884 0.7595 1.5215 31.9837 2.7128 6.7019 48.7398 0.0555 109.2522 0.4694 6.1590 0.8059 2.7525 7.0269 4.8039 3.8666 9.5088 0.1740 0.1717 1.0256 1.5988 1.2707 0.1167 5.9818 10.4939 4.2206 21.8738 16.1225 69.4174 13.3342 27.5939 15.2829 20.0130 34.0668 12.5731 11.6407 29.1581 23.6918 17.0231 1.4607 0.2500 0.0518 22.8505 10.0128 2.9686 11.3539 2.2051 21.0411 5.0865 66.5666 9.8997 0.0965 1.0867 53.0514 3.9672 1.3921 0.8277 21.7131 0.7837 1.8866 0.9862 2.2963 0.1071 3.6400 0.3193 0.8801 26.2097 1.6961 0.8608 0.1701 0.0072 0.0286 2.5525 5.1914 3.6976 23.9578 11.7778 4.5566 0.6279 0.5038 7.9656 13.6682 20.5271 2.7720 1.4856 0.2597 1.9945 0.3448 1.5270 0.0337 0.2347 6.9906 1.8096 3.2486 5.5119 0.5097 5.3910 24.5170 29.6278 11.6608 11.9171 4.5722 0.2138 6.7893 0.0326 0.4427 4.1258 0.5700 2.0259 0.0626 1.6370 2.6800 1.0689 36.7261 41.9727 0.0871 0.5533 7.9450 17.3756 1.7215 8.4484 0.5829 2.0153 2.4107 94.0342 39.5450 2.3997 0.1207 5.6056 0.4525 0.2330 78.0326 88.0638 2.2547 6.6767 5.2527 1.9023 9.5396 6.9128 84.9943 0.0987 2.5141 5.0549 3.4063 4.1466 9.0153 3.9551 36.4560 30.6054 3.9194 12.4710 3.9910 13.3585 6.3497 7.4204 4.5843 7.9518 20.0567 2.9713 72.3007 3.2772 40.4894 5.1440 4.7036 8.2511 104.3619 6.7779 10.2354 3.9407 0.0945 0.6010 1.1048 43.4183 0.8932 0.3348 0.9208 2.0826 9.6667 199.2894 40.6766 17.6511 104.0949 51.9547 24.3574 15.0062 18.9028 24.4082 15.8497 23.6673 18.2957 26.8175 6.4253 10.7214 7.8207 14.5315 11.0192 8.4250 8.1689 7.8216 10.5156 10.4339 9.7162 10.4267 5.3813 12.7305 6.6077 12.8351 1.9487 8.7648 2.5476 0.8317 1.0878 0.3282 0.5631 0.2958 0.4692 3.5247 1.4820 6.6196 5.7807 9.6959 12.1661 6.1413 3.9633 12.8469 8.9713 17.3430 15.3774 5.0060 2.3629
temp: 298.150 k
press: 1.00000 atm
elementType: 77 1 15 6 6 1 1 7 7 6 1 6 6 6 6 6 6 1 1 1 1 1 6 8 6 6 6 6 6 6 1 1 6 6 6 6 6 6 1 1 6 1 1 1 6 1 1 1 6 1 1 1 6 1 1 1 6 1 1 1 6 1 1 1 6 6 6 6 1 6 1 6 1 1 1 6 6 6 1 6 1 6 1 1 1 6 6 6 6 1 6 1 6 1 1 1 6 8 6 1 1 1
symmnumber: 1
zpe: 2182187.6 jmol-1
zpe.correction: 0.831151 hartree
zpe.thermalcorrener: 0.883499 hartree
zpe.thermalcorrenthalpy: 0.884443 hartree
zpe.thermalcorrgfe: 0.741028 hartree
zpe.sumelectzpe: -2525.553308 hartree
zpe.sumelectthermal: -2525.500961 hartree
zpe.sumelectthermalent: -2525.500017 hartree
zpe.sumelectthermalfe: -2525.643432 hartree
dipole: 1.7921 -1.2078 1.0558
dipole: 2.4052
quadrupole: -260.4691 -271.0881 -284.0327
quadrupole: 1.4897 8.8120 2.6121
quadrupole: 11.3942 0.7752 -12.1694 1.4897 8.8120 2.6121
hfenergy: -2526.3844599 hartree
pointgroup: C01 [X(C47H49Ir1N2O2P1)]
dipole: 0.5816082 -0.5400017 0.3066018 debye
polarizability: 670.3708425|13.7700224|525.3999138|20.8224339|-0.7252858|538.2896571 unknown
InChI: InChI=1/47C.Ir.2N.2O.P.49H
charge 1 multiplicity 1
102 atoms
Ir -0.15298873 -0.29515192 -0.17088212
H  -1.61208271 -0.55892381 0.49917924
P  -0.67565352 2.01462465 0.00875433
C  -0.87819774 -4.49579102 -0.718656
C  0.45296582 -4.56802176 -0.4987085
H  -1.61093306 -5.25572388 -0.93298209
H  1.13314161 -5.40319043 -0.47780378
N  -1.22811193 -3.16065559 -0.62164192
N  0.88847957 -3.2727265 -0.27494349
C  -0.14179399 -2.38477366 -0.34224075
H  -1.08486109 -0.2494441 -1.44540628
C  2.63465384 0.36546254 0.73991869
C  1.92293027 0.36272914 -0.48619926
C  2.59123503 0.89340986 -1.59713996
C  3.89237198 1.37720046 -1.50656305
C  4.58133529 1.35007456 -0.2957549
C  3.94527751 0.85015815 0.8259965
H  0.76914315 -0.38982634 -1.46968388
H  2.09136985 0.93334757 -2.56026125
H  4.37286344 1.77644363 -2.39462059
H  5.59627211 1.72617937 -0.23027439
H  4.4398484 0.84235506 1.79237196
C  1.91458843 -0.04950572 1.93172446
O  0.72793963 -0.41771591 1.89077742
C  2.25644729 -2.94764056 0.02308513
C  3.10877898 -2.57729911 -1.02169085
C  2.68949342 -3.06060701 1.34710637
C  4.42548635 -2.26402136 -0.69482136
C  4.01719859 -2.73482935 1.6203457
C  4.8965944 -2.32898217 0.61708271
H  5.09986225 -1.94983639 -1.48776833
H  4.36994457 -2.79475723 2.64725613
C  -2.57999509 -2.70032935 -0.79810167
C  -3.01409693 -2.37456469 -2.08532352
C  -3.40555608 -2.61403097 0.32527903
C  -4.33213672 -1.94540056 -2.22930769
C  -4.71547925 -2.18090484 0.12713192
C  -5.19926073 -1.85105524 -1.13941325
H  -4.69273497 -1.68725562 -3.22183949
H  -5.37618559 -2.1031451 0.9868864
C  -2.88457273 -2.95111839 1.68731807
H  -2.05360631 -2.29159457 1.96303279
H  -3.66264369 -2.84865033 2.44390625
H  -2.50335873 -3.97621424 1.7355599
C  -6.62623717 -1.43835334 -1.33366242
H  -7.23881142 -2.29046208 -1.64517559
H  -7.06597261 -1.05000529 -0.41290373
H  -6.72698455 -0.67810263 -2.11176481
C  -2.09469549 -2.49036973 -3.26192783
H  -1.16449551 -1.93511149 -3.10309578
H  -1.80834671 -3.53029219 -3.45004983
H  -2.56543634 -2.10995102 -4.16869883
C  1.75822624 -3.52447445 2.42501482
H  0.84079502 -2.92773271 2.45369157
H  1.45130972 -4.56383376 2.26989069
H  2.23681614 -3.47338726 3.40418216
C  2.63170219 -2.53951367 -2.44037457
H  3.35085272 -2.03002392 -3.08283091
H  2.49229235 -3.55056741 -2.83820846
H  1.66712688 -2.03327846 -2.5403563
C  6.31770088 -1.98051218 0.9337389
H  6.9848693 -2.8246623 0.73262831
H  6.67041184 -1.14576432 0.3232235
H  6.44427084 -1.71348881 1.9845987
C  0.08330778 2.74736282 1.49359912
C  -0.59541258 2.6983918 2.71688821
C  1.40464556 3.20748873 1.46570715
C  0.02679454 3.13059214 3.88170569
H  -1.61590452 2.32808 2.75491825
C  2.025367 3.63178462 2.63552934
H  1.95115433 3.23537309 0.52702399
C  1.33759314 3.59837382 3.84357745
H  -0.51524367 3.10500722 4.82143262
H  3.04866941 3.99107291 2.59860131
H  1.81993786 3.93936771 4.75358241
C  -2.84097678 3.69136563 0.55088458
C  -3.43606447 1.4888411 -0.23619368
C  -4.18312566 4.04094429 0.59344342
H  -2.08842745 4.41844986 0.84367452
C  -4.77998358 1.84748187 -0.19837614
H  -3.15583875 0.49079132 -0.5568993
C  -5.15578941 3.11826706 0.21821632
H  -4.47051194 5.03525755 0.9177855
H  -5.5327192 1.12445133 -0.49389116
H  -6.20462025 3.3934023 0.25035447
C  -0.152556 3.05985508 -1.39684124
C  0.18020449 4.40869803 -1.23813684
C  -0.18705355 2.51624364 -2.68428732
C  0.49837509 5.18718361 -2.34475837
H  0.19584879 4.8557706 -0.24908014
C  0.12218044 3.29956687 -3.78919543
H  -0.45918885 1.47310344 -2.81955681
C  0.47288192 4.63464758 -3.62054411
H  0.76186379 6.23054674 -2.20848621
H  0.0893013 2.86660886 -4.78344484
H  0.71939607 5.24555289 -4.48221495
C  -2.45584439 2.40749106 0.14431765
O  2.57184544 0.02071209 3.07584675
C  1.81530237 -0.26968698 4.26453251
H  0.96379266 0.408005 4.33894449
H  1.46060061 -1.30039438 4.24859174
H  2.50470125 -0.11364848 5.08976581
