program: Gaussian 16
title: [Ir(H)2(MePhIm)(IMes)(PPh3)]
version: ES64L-G16RevC.01
method: RM06L
basis: GenECP
operation: Freq
keyword: #P
keyword: Geom=AllCheck
keyword: Guess=TCheck
keyword: SCRF=Check
keyword: GenChk
keyword: RM06L/GenECP
keyword: Freq
converged: YES YES NO NO
title: Mulliken charges:
elementType: C C C C C C H C H H H C H H H C C H H C H H H H N N C C H C C H H H C C C H H H H C C H H H Ir H H C P C C C C C C C C C C H C H C H C H C H C H C H H C H H C H H H H H C C C C C C H C H C H H H N H H C N C H H H
charge: 0.041261 0.026866 0.019150 -0.183342 0.044499 -0.187431 0.101900 -0.255002 0.130136 0.125773 0.114890 -0.246835 0.100850 0.139971 0.120158 -0.031101 -0.027008 0.150468 0.151789 -0.249504 0.130628 0.125284 0.136656 0.106032 -0.350049 -0.352056 -0.173000 -0.170509 0.108256 0.036589 -0.258323 0.119707 0.122581 0.140739 0.045949 0.033905 -0.257989 0.122292 0.092189 0.138414 0.102457 0.014740 -0.255928 0.119197 0.139877 0.108036 0.366566 -0.009532 -0.104393 0.073607 0.522065 -0.205726 -0.232554 -0.223215 -0.110599 -0.103675 -0.076636 -0.070304 -0.110939 -0.106637 -0.089082 0.136074 -0.093948 0.159243 -0.102133 0.134887 -0.113164 0.146689 -0.105082 0.143268 -0.100187 0.137702 -0.109537 0.122141 0.125115 -0.091134 0.124023 0.115890 -0.115470 0.121856 0.123941 0.120855 0.125660 0.124445 -0.073769 -0.015064 0.017943 -0.140641 -0.134752 -0.094106 0.124025 -0.084105 0.079618 -0.115368 0.127830 0.124869 0.128279 -0.460149 0.141014 0.155356 0.444824 -0.340146 -0.178501 0.144135 0.139099 0.146371
chargesum: 1.00000
title: Mulliken charges with hydrogens summed into heavy atoms:
elementType: C C C C C C C C C C C N N C C C C C C C C C Ir C P C C C C C C C C C C C C C C C C C C C C C C C C C C N C N C
charge: 0.041261 0.026866 0.019150 -0.077311 0.044499 -0.085531 0.115797 0.114143 0.119368 0.124781 0.143064 -0.350049 -0.352056 -0.064745 -0.068052 0.036589 0.124704 0.045949 0.033905 0.094906 0.014740 0.111182 0.252641 0.073607 0.522065 -0.205726 -0.232554 -0.223215 0.025475 0.055568 0.058251 0.076385 0.032329 0.031066 0.033058 0.031168 0.021890 0.002726 0.016773 0.023754 0.011318 0.034525 0.008975 0.081587 0.125951 0.017943 -0.016615 -0.055134 0.033725 0.040763 0.012911 -0.460149 0.444824 -0.340146 0.251105
polarizability: 6.81117740e+02 -5.23812724e+00 5.57440821e+02 7.96102172e+00 -6.88915646e+00 5.71705569e+02
1716.lowfreq: -2.0843 -1.3119 0.0009 0.0011 0.0012 2.1727 2.6276 12.1355 19.1350
redmass: 4.9335 5.3732 4.0875 5.0866 5.3646 4.5448 4.9358 4.8247 4.1730 1.1403 3.9184 3.7025 4.2623 4.5397 4.1856 3.7614 4.6132 4.1681 3.6045 1.1693 3.0617 3.3873 4.5256 1.1282 2.4153 3.7727 1.9487 2.6576 3.2944 1.7952 2.2062 1.6961 4.7399 2.4178 5.7556 5.5984 4.1878 3.3789 3.6000 2.9634 4.4102 1.9240 1.9186 2.7034 3.0235 4.2242 4.6902 4.9705 4.1243 4.5787 2.4978 2.5257 4.6969 3.2205 3.3607 3.0247 4.4758 4.0731 5.0244 5.2766 4.8696 2.8957 2.9070 2.9274 4.7161 4.5552 4.6194 4.3469 5.6381 3.5315 4.1186 2.5403 3.3233 1.8246 3.5761 3.1710 3.9032 3.4871 5.9231 2.4374 4.1137 4.4825 3.7778 4.0017 3.7520 3.9001 3.3435 5.0563 6.2583 6.3787 5.9573 4.9121 4.6269 5.1508 5.7242 3.3670 5.5761 3.1796 1.8980 2.0228 2.2016 4.2260 3.1891 2.4397 2.1390 3.6013 1.3138 4.3187 2.0466 3.1469 1.8669 1.8969 2.0940 1.2889 1.0935 1.2884 1.1588 1.2072 1.2563 1.2466 1.2527 1.1884 1.1996 1.0958 1.2956 1.2941 1.3224 1.3164 1.3174 1.3105 3.9793 4.8627 2.4256 2.2842 2.3605 1.4484 1.3788 3.5530 1.3673 1.3707 4.0186 1.2903 1.2616 1.2857 1.2673 3.5988 5.2268 6.0029 6.0681 1.6460 1.7965 1.5468 3.5880 1.7875 1.5694 1.5645 1.5505 1.5764 2.4866 1.6799 2.7660 2.2853 1.7601 2.0222 1.9846 1.9362 1.6764 1.8256 2.3801 1.7129 1.4123 1.3696 1.5982 2.7755 2.8530 2.7274 2.7043 1.5731 1.3224 1.0820 1.0823 1.0878 1.0875 1.6015 1.6673 1.4439 1.1341 1.1309 1.1319 1.1359 2.3538 1.3602 1.3595 4.0110 6.1621 3.1695 1.5970 1.5834 1.5108 3.6209 1.4849 3.3861 9.8033 6.3575 6.6024 3.8175 4.3717 5.1535 4.3271 4.6334 5.7715 1.2535 1.2579 1.2502 1.2855 1.4826 1.4855 2.8340 1.4637 1.8401 1.9342 1.9490 1.4103 2.1554 1.3201 2.1843 1.5637 1.3398 1.0628 1.0993 1.1667 1.8798 1.0544 1.0622 1.0729 1.0758 1.0752 1.2673 1.5934 1.5642 2.0858 2.1132 2.0880 3.2283 2.5158 2.5116 3.5733 4.5738 5.2158 5.4211 5.5718 5.7160 5.6429 5.6697 6.5868 6.3387 5.6765 7.6684 6.1402 6.0375 6.0167 1.0131 1.0130 1.0443 1.0884 1.0392 1.0393 1.0403 1.0392 1.0385 1.0350 1.0942 1.0986 1.0969 1.0969 1.0994 1.0964 1.1031 1.1021 1.1020 1.1013 1.1006 1.1020 1.1007 1.0909 1.0863 1.0905 1.0904 1.0906 1.0872 1.0865 1.0860 1.1050 1.0862 1.0862 1.0862 1.0902 1.0896 1.0899 1.0912 1.0933 1.0943 1.0944 1.0989 1.0991 1.0990 1.0971 1.0921 1.0898 1.0899 1.1087 1.1121
irintensity: 0.1791 0.1441 0.0474 0.2024 0.5132 0.4911 0.2040 0.6079 0.1060 0.1766 0.0360 0.5051 0.2997 0.3906 0.1552 0.2874 0.1954 0.0532 0.2758 0.6813 0.4360 1.0628 0.2588 0.2065 0.2543 0.4900 0.1060 0.1998 0.9305 0.3754 0.3252 0.3838 0.2347 0.3370 0.4311 0.3501 3.4059 2.1796 1.0506 5.9970 2.3642 0.4368 0.3069 0.1103 0.1600 0.4421 0.6469 0.2535 0.2703 0.4676 0.0427 0.4300 0.4086 0.7277 0.7194 0.5318 0.5472 0.1918 1.4550 1.0590 0.0436 0.0861 0.2811 0.1606 7.3841 5.5750 4.4097 5.6333 8.1369 1.1823 3.2502 4.5821 0.5046 1.7494 32.3471 4.2065 28.1231 10.6336 125.3927 1.6791 0.0547 2.0248 2.0570 3.0313 4.9296 2.5752 1.4054 0.4767 0.0171 0.1074 0.1433 1.6960 0.4355 0.0948 4.2281 28.3246 2.6240 24.9900 52.9776 49.3333 10.5273 16.0851 27.9266 41.3907 4.3541 5.0818 9.4845 0.6256 5.4825 6.5935 11.4800 8.6950 30.4602 0.1215 5.9792 1.4647 11.6960 1.9399 20.8402 4.8417 16.9941 4.1828 3.5466 48.4194 0.8729 0.7374 1.3823 5.5808 5.0990 0.4379 24.9406 4.8485 1.8792 4.5720 4.2316 1.5090 0.0624 4.2544 0.2739 0.0566 2.0259 0.3898 0.5133 0.0172 0.1759 1.7432 4.0919 2.1934 2.0041 9.6981 3.5843 0.3239 1.2483 1.3981 0.8990 16.7487 7.5782 7.3370 0.2140 1.5657 0.4312 0.7632 3.6297 0.4277 0.0657 0.0493 0.3314 2.0900 7.4934 1.1472 0.9965 3.6901 2.2330 22.2530 28.6599 14.0227 6.2282 10.5243 1.2200 0.3120 0.1432 2.0869 0.6330 2.9331 12.3401 0.2687 3.8056 1.0528 1.9964 0.6774 35.5097 0.3308 0.2837 3.6440 25.3652 12.4327 5.3811 1.9712 6.8479 2.8534 1.6138 7.8941 74.9886 0.2025 4.8085 0.1790 0.8471 0.3506 1.8476 1.7484 0.6719 1.7636 2.9329 5.7134 5.0513 11.2488 1.8075 83.6048 18.0293 0.2632 2.0659 5.2114 6.1354 8.7844 0.6650 25.6334 17.9919 2.9819 6.4068 4.1380 12.4667 0.4688 8.4773 7.2805 5.7524 1.2217 11.5718 15.8909 6.7017 26.8578 6.7143 2.8382 7.3033 60.6845 99.9611 3.4493 16.2219 9.8206 5.2484 0.1667 0.1289 1.8085 1.0272 0.4451 1.8909 1.3696 1.0487 6.7491 0.9066 27.1040 11.3010 129.1081 6.1656 15.7020 29.3942 24.4630 14.9122 21.1630 19.8850 19.2850 27.5716 11.3798 6.1660 11.0164 5.5152 12.6606 14.8490 5.3396 8.7562 13.6308 5.4594 9.0936 2.6008 9.7464 17.7044 1.8537 8.1903 14.6076 9.3899 2.1439 0.7698 1.3358 3.5205 0.2047 0.0522 0.4650 5.6389 1.8338 1.0277 6.8212 6.8555 14.3624 14.0936 15.1962 20.0799 18.2882 7.0617 3.3443 3.8794 4.8909 0.3749 1.3657
temp: 298.150 k
press: 1.00000 atm
elementType: 6 6 6 6 6 6 1 6 1 1 1 6 1 1 1 6 6 1 1 6 1 1 1 1 7 7 6 6 1 6 6 1 1 1 6 6 6 1 1 1 1 6 6 1 1 1 77 1 1 6 15 6 6 6 6 6 6 6 6 6 6 1 6 1 6 1 6 1 6 1 6 1 6 1 1 6 1 1 6 1 1 1 1 1 6 6 6 6 6 6 1 6 1 6 1 1 1 7 1 1 6 7 6 1 1 1
symmnumber: 1
zpe: 2290194.3 jmol-1
zpe.correction: 0.872289 hartree
zpe.thermalcorrener: 0.926162 hartree
zpe.thermalcorrenthalpy: 0.927107 hartree
zpe.thermalcorrgfe: 0.778528 hartree
zpe.sumelectzpe: -2562.025450 hartree
zpe.sumelectthermal: -2561.971577 hartree
zpe.sumelectthermalent: -2561.970633 hartree
zpe.sumelectthermalfe: -2562.119211 hartree
dipole: -4.2135 -1.9058 3.1297
dipole: 5.5840
quadrupole: -262.7375 -289.6282 -291.4131
quadrupole: -3.7282 -8.8283 -2.9577
quadrupole: 18.5221 -8.3686 -10.1535 -3.7282 -8.8283 -2.9577
hfenergy: -2562.8977394 hartree
pointgroup: C01 [X(C49H51Ir1N4P1)]
dipole: -1.485044 -0.845033 1.1554546 debye
polarizability: 681.1177401|-5.2381272|557.4408215|7.9610217|-6.8891565|571.7055691 unknown
InChI: InChI=1/49C.Ir.4N.P.51H
charge 1 multiplicity 1
106 atoms
C  -2.43736192 -3.42950169 0.49239846
C  -1.59969189 -3.25504718 -0.61203434
C  -2.09347814 -2.96658651 -1.89103431
C  -3.47088515 -2.83276074 -2.03820157
C  -4.34341082 -2.95666142 -0.95551382
C  -3.80857107 -3.26075459 0.29498361
H  -4.47774955 -3.38451645 1.14384131
C  -5.81115348 -2.72119311 -1.12958942
H  -6.03186331 -1.64791092 -1.11797092
H  -6.17351916 -3.10921043 -2.08369183
H  -6.39515186 -3.18271328 -0.33167688
C  -1.88983391 -3.81486811 1.83110435
H  -2.60112956 -3.5903691 2.62871488
H  -1.6834572 -4.88960131 1.8780454
H  -0.95145247 -3.30251937 2.05502311
C  0.4851403 -4.60049676 -0.55264795
C  1.80333924 -4.3266962 -0.44018056
H  -0.0447359 -5.52676642 -0.70027268
H  2.66987266 -4.96649995 -0.45903565
C  -1.15973334 -2.74044831 -3.04011547
H  -0.43966331 -3.55620245 -3.15532504
H  -1.70604007 -2.63645446 -3.97820432
H  -0.56611835 -1.82909106 -2.88883149
H  -3.87279313 -2.60048671 -3.02158379
N  -0.18052873 -3.38909523 -0.44813366
N  1.91633024 -2.95736111 -0.27671198
C  5.05193684 -1.17520945 -1.10750811
C  4.91802801 -1.43978995 1.2712132
H  5.57888682 -0.81498136 -1.98785175
C  3.83658067 -1.83756877 -1.27895574
C  3.25621453 -2.06781157 -2.63924914
H  3.86690625 -1.60039731 -3.41209488
H  3.18749093 -3.13575716 -2.8715456
H  2.24257931 -1.66238282 -2.7129184
C  3.17928589 -2.28596886 -0.13041158
C  3.70364547 -2.11077156 1.15405159
C  2.99290195 -2.64633564 2.35831478
H  3.31235082 -2.13324952 3.26685859
H  1.90785968 -2.55098495 2.26582038
H  3.20035984 -3.71271227 2.49982301
H  5.33811622 -1.28558874 2.26205629
C  5.60790025 -0.96651502 0.1543956
C  6.92657646 -0.274301 0.31462853
H  6.89509794 0.46964305 1.11504581
H  7.71439782 -0.98669776 0.57828278
H  7.23751134 0.2254649 -0.60452925
Ir 0.35365029 -0.30936619 -0.12628068
H  1.78069257 -0.25419031 0.46782785
H  1.15257992 -0.20360954 -1.5004048
C  0.69065952 -2.34762939 -0.27380997
P  0.38618189 2.03785908 -0.15421855
C  2.02214773 2.71486222 0.31954069
C  0.09438217 2.82662521 -1.77908787
C  -0.79249509 2.87401281 0.96801805
C  2.16910597 3.8602964 1.10654862
C  3.16386955 2.09128305 -0.19739956
C  0.26542788 4.20702893 -1.93515968
C  -0.29222153 2.06125828 -2.87978904
C  -0.66136493 2.64592521 2.34455849
C  -1.86774212 3.63775535 0.50916432
C  3.43641204 4.36599992 1.37905955
H  1.29463489 4.36081518 1.51128811
C  4.42526627 2.60737488 0.06767756
H  3.06240876 1.19964639 -0.81068757
C  0.03696617 4.80791319 -3.16538737
H  0.58280312 4.81259759 -1.0900518
C  -0.52266891 2.66476628 -4.11215407
H  -0.39284191 0.98545275 -2.76805336
C  -1.57950113 3.17777623 3.23977325
H  0.1696405 2.04995304 2.71400739
C  -2.78319107 4.17531881 1.40954751
H  -1.99840892 3.81042519 -0.55455779
C  4.56523037 3.74302982 0.85965521
H  3.53891494 5.25298373 1.99532355
H  5.30054166 2.11958886 -0.34880445
C  -0.36127152 4.03753065 -4.25509474
H  0.17496228 5.87803359 -3.27705885
H  -0.81841948 2.06028202 -4.96357064
C  -2.64349485 3.94737489 2.77311435
H  -1.4583304 3.00052774 4.30408955
H  -3.61009151 4.77289435 1.03906026
H  5.55151545 4.14350102 1.06920567
H  -0.53542907 4.50823656 -5.21683653
H  -3.35485923 4.37405844 3.47289932
C  -0.42920637 -0.8200994 3.00105535
C  -1.49773114 -0.83416749 3.8491335
C  -2.95390856 0.263545 0.71268924
C  -4.09539093 1.05654206 0.89423352
C  -2.51030983 0.03955078 -0.60007929
C  -4.76849734 1.59220789 -0.19520056
H  -4.42866704 1.31375163 1.89168099
C  -3.1817959 0.57923642 -1.68753928
H  -1.70954049 -0.68485316 -0.79685587
C  -4.31635158 1.35861488 -1.48967682
H  -5.64083302 2.21515245 -0.0282936
H  -2.82928188 0.37126215 -2.69256692
H  -4.84349363 1.78001056 -2.33854988
N  -0.84928833 -0.46932609 1.7485799
H  -1.58732229 -1.07632833 4.89548197
H  0.60796174 -1.02644986 3.21092232
C  -2.16444512 -0.24331483 1.82444958
N  -2.59424547 -0.48151846 3.10012941
C  -3.95599202 -0.491063 3.60421552
H  -4.64105955 -0.80527406 2.81687537
H  -4.0187376 -1.20186595 4.42772416
H  -4.25416487 0.49487702 3.96930856
