program: Gaussian 16
title: [Ir(H)2(MePhIm)(IMes)(PPh3)]
version: ES64L-G16RevC.01
method: RM06L
basis: GenECP
operation: Freq
keyword: #P
keyword: Geom=AllCheck
keyword: Guess=TCheck
keyword: SCRF=Check
keyword: GenChk
keyword: RM06L/GenECP
keyword: Freq
converged: YES YES YES YES
title: Mulliken charges:
elementType: C C C C C C H C H H H C H H H C C H H C H H H H N N C C H C C H H H C C C H H H H C C H H H Ir H H C P C C C C C C C C C C H C H C H C H C H C H C H H C H H C H H H H H C C C C C C H C H C H H H N H H C N C H H H
charge: 0.025940 0.099169 0.027845 -0.210750 0.010290 -0.159779 0.107787 -0.245565 0.140573 0.113596 0.110259 -0.257311 0.118696 0.133191 0.111613 -0.038442 -0.026458 0.155422 0.154128 -0.285017 0.154701 0.145826 0.118159 0.108623 -0.364234 -0.340197 -0.158801 -0.177253 0.099853 0.047555 -0.259117 0.117324 0.127317 0.128777 0.045689 0.043731 -0.259497 0.128819 0.121550 0.111703 0.100202 0.025259 -0.247294 0.116648 0.136805 0.102518 0.509716 -0.071524 -0.131552 0.009437 0.449832 -0.194805 -0.246251 -0.225602 -0.099453 -0.089014 -0.106681 -0.058618 -0.100570 -0.092766 -0.099109 0.130115 -0.095910 0.140809 -0.095735 0.144716 -0.114020 0.125168 -0.107333 0.146610 -0.109426 0.140093 -0.116012 0.121324 0.119718 -0.092808 0.125627 0.113871 -0.099240 0.121208 0.127013 0.124449 0.124702 0.126653 -0.052980 -0.013046 -0.079199 -0.136781 -0.107832 -0.112480 0.141286 -0.086791 0.136342 -0.098711 0.121702 0.128585 0.129728 -0.423489 0.137309 0.151040 0.393895 -0.309651 -0.153528 0.139202 0.133961 0.146954
chargesum: 1.00000
title: Mulliken charges with hydrogens summed into heavy atoms:
elementType: C C C C C C C C C C C N N C C C C C C C C C Ir C P C C C C C C C C C C C C C C C C C C C C C C C C C C N C N C
charge: 0.025940 0.099169 0.027845 -0.102127 0.010290 -0.051991 0.118863 0.106188 0.116980 0.127670 0.133669 -0.364234 -0.340197 -0.058949 -0.077051 0.047555 0.114301 0.045689 0.043731 0.102575 0.025259 0.108677 0.306640 0.009437 0.449832 -0.194805 -0.246251 -0.225602 0.030662 0.051795 0.038035 0.066550 0.046040 0.047327 0.022215 0.023808 0.029892 -0.000149 0.013874 0.017588 0.008437 0.031894 0.027412 0.098061 0.124263 -0.079199 0.004505 0.028510 0.009222 0.041794 0.031016 -0.423489 0.393895 -0.309651 0.266589
polarizability: 6.71960226e+02 3.77701163e+01 6.05818854e+02 2.25957892e+01 -3.21944889e+01 5.36503813e+02
1716.lowfreq: -33.4722 -4.4531 -2.4144 0.0009 0.0010 0.0010 7.1458 13.4259 22.5498
redmass: 4.2282 4.8589 4.9076 4.7119 4.9723 4.7423 4.5207 4.8479 3.1916 4.5064 3.3920 4.2727 4.6572 3.3263 2.3500 1.2300 3.0659 3.1858 3.5145 2.7638 4.1015 2.7262 1.7585 2.2270 4.2618 3.2004 4.1924 2.9240 3.3644 1.7676 2.3972 1.7130 2.5992 4.9353 1.2099 5.8958 3.8983 3.1593 3.1307 4.3971 3.9964 4.5727 3.2730 4.2887 3.1574 5.1445 4.7012 4.8968 3.8022 3.6243 2.5281 4.3031 2.6345 2.4641 1.9344 5.1213 2.3423 2.4417 4.2863 4.7429 4.8315 2.9321 2.8988 3.0108 2.9799 3.1401 4.5295 5.2565 6.4495 5.3322 1.6414 2.1461 3.3677 3.3324 4.9178 4.3279 3.2305 2.8793 5.5451 3.2821 4.1554 4.4433 4.1909 3.8430 3.5435 4.2873 3.3358 5.8277 6.3799 6.3819 6.3958 3.9789 4.7997 4.8914 5.3049 3.7704 6.3132 1.9610 1.9192 5.3572 1.8592 2.0513 4.2469 1.7233 3.3979 1.5399 4.0377 3.1757 4.2379 1.7759 1.7789 1.8814 2.2731 1.0626 1.2774 1.0798 1.3045 1.2514 1.2506 1.2500 1.2607 1.2392 1.2472 1.2894 1.2692 1.2453 1.2843 1.3253 1.4268 1.3444 2.6328 5.1047 2.4777 2.1345 2.1720 1.3689 3.3193 1.3748 1.3653 1.3918 3.6202 1.2706 1.2676 1.2785 1.2802 1.5890 6.1819 6.1920 5.8767 5.9216 1.7720 1.6993 4.0088 1.5513 1.6800 1.5693 1.5554 2.7419 2.6408 1.6420 2.6277 1.7406 1.8329 1.6569 1.7425 1.9594 1.7206 1.5823 2.1035 1.2856 1.8883 1.7837 1.5869 1.6179 2.7718 2.8461 2.6181 2.7090 1.3313 1.9983 1.0867 1.0829 1.0830 1.0841 1.5464 1.1313 1.4376 1.1357 1.1341 1.1364 2.3155 4.0880 1.5844 1.3633 3.8419 3.0378 1.5472 1.6186 3.0794 1.5336 1.4982 3.4939 7.1694 6.6629 4.2419 3.9015 4.5313 6.0349 4.9843 4.0083 1.5157 3.7937 1.2484 1.2623 1.2779 1.5100 1.3882 1.5210 2.8811 1.7962 1.9263 1.3128 1.3499 2.1917 2.1779 1.1583 2.1657 1.1021 2.0336 1.1994 1.7753 1.0767 1.0623 1.0621 1.0568 1.0706 1.1406 1.5824 1.4719 1.5800 2.0891 2.0948 2.1257 2.0743 2.2119 2.4845 3.9542 4.8690 5.3056 5.5136 5.4885 5.6898 5.6360 5.6079 5.5993 7.2124 5.7655 7.6770 6.0117 5.9932 6.0219 1.0129 1.0129 1.0670 1.0417 1.0387 1.0387 1.0383 1.0395 1.0381 1.0671 1.0955 1.0992 1.0995 1.0990 1.0972 1.0996 1.1018 1.1007 1.1007 1.1011 1.1016 1.0937 1.0989 1.0864 1.0903 1.0905 1.0904 1.0861 1.0847 1.0861 1.0853 1.0859 1.0867 1.0910 1.0907 1.1050 1.0903 1.0887 1.0945 1.0946 1.0936 1.0929 1.0989 1.0991 1.0990 1.0975 1.0928 1.0902 1.0906 1.1081 1.1115
irintensity: 1.4637 0.0269 0.0269 0.0398 0.1606 0.1514 0.2982 0.1842 0.1415 0.0634 0.1389 0.2561 0.2268 0.1310 0.2626 0.1704 0.1684 0.0481 0.4382 0.2419 0.7619 0.4960 0.1648 0.2426 0.9660 0.2819 0.3506 0.2451 1.1197 1.7815 0.0878 0.1899 0.6634 0.2522 0.4888 0.1970 2.6644 1.7007 3.6419 2.3870 0.0727 0.5833 0.2349 0.5137 0.0046 0.9457 0.6039 0.2831 0.1720 0.8808 0.1836 0.3124 0.1867 0.8094 0.9606 0.3330 5.1250 2.1031 0.7106 2.2301 0.2136 0.0379 0.2893 1.3340 0.0483 1.9761 5.8608 7.4397 11.2367 9.1129 4.6049 0.4444 2.3342 1.8881 24.3608 40.7406 9.2709 3.6999 119.2375 4.3682 0.2855 1.9051 0.2228 2.7015 4.5406 0.9010 1.1438 0.4233 0.3505 0.1413 0.6464 1.0655 1.1273 0.2985 2.7455 19.7661 8.8316 23.3764 29.0088 15.2607 35.0958 40.4655 36.4213 28.3917 2.3092 10.4118 2.2021 5.3420 1.1035 10.8783 12.1671 15.1208 39.6486 6.4756 0.2081 9.3057 4.6521 2.3422 1.1905 2.9420 15.4595 1.2264 12.9708 1.0587 2.5672 16.5256 21.0056 3.0649 6.5742 0.3886 12.3362 4.2826 1.6323 1.9769 1.0765 0.0549 4.2870 0.3159 2.0442 1.4115 1.3798 0.0436 0.0581 0.2638 0.5272 2.5892 3.7827 2.1136 2.7824 0.9633 9.7763 6.7562 2.9614 0.5460 0.7429 7.1826 8.9696 0.4774 3.3589 7.3638 0.3549 2.0379 1.0019 0.6145 3.9230 0.0525 0.9609 0.8195 4.4284 2.6058 4.5383 0.6905 0.3477 1.7075 22.7565 23.7014 21.6368 3.7120 3.5205 22.2697 0.4130 0.4616 0.1632 0.2555 2.3381 0.3023 0.4284 0.9742 3.4092 2.7000 28.5411 0.7444 13.6180 0.3224 25.4992 19.2176 2.9289 4.4473 1.9504 0.3566 2.9071 10.0943 58.6383 2.8269 0.8428 0.5495 0.5804 7.4045 0.0477 7.3344 2.8727 3.2791 6.4724 2.3075 6.8965 11.0475 4.1586 6.3115 101.5205 5.5655 2.1296 6.6962 3.3903 15.0390 13.6947 16.9619 17.1085 9.2468 2.0224 6.3432 5.3263 10.0510 10.4722 4.7335 8.9883 2.6146 13.0010 51.7292 18.7198 24.1747 42.0240 6.9629 3.0929 6.7443 111.5433 2.5709 9.9429 4.4655 5.1924 0.8848 0.2950 0.7673 0.6308 0.0805 0.9865 2.2007 1.0591 5.1089 2.7111 27.7983 6.0122 120.8057 25.2424 95.3366 24.2118 21.5050 21.9371 24.5463 18.7160 35.7801 11.0396 15.1418 10.9738 10.6087 11.6788 8.8279 5.1334 8.2679 6.6660 25.2844 7.8351 4.9461 6.2215 8.7568 2.4879 11.7230 14.0975 10.6858 0.7790 1.4012 0.2898 0.5725 0.3377 0.3856 2.0116 5.8729 2.1865 1.4116 6.7298 11.8522 12.7314 9.9100 4.7421 17.6908 19.2516 15.8477 6.3425 6.2460 3.7526 5.6735 0.1533 1.0010
temp: 298.150 k
press: 1.00000 atm
elementType: 6 6 6 6 6 6 1 6 1 1 1 6 1 1 1 6 6 1 1 6 1 1 1 1 7 7 6 6 1 6 6 1 1 1 6 6 6 1 1 1 1 6 6 1 1 1 77 1 1 6 15 6 6 6 6 6 6 6 6 6 6 1 6 1 6 1 6 1 6 1 6 1 6 1 1 6 1 1 6 1 1 1 1 1 6 6 6 6 6 6 1 6 1 6 1 1 1 7 1 1 6 7 6 1 1 1
symmnumber: 1
zpe: 2289388.7 jmol-1
zpe.correction: 0.871982 hartree
zpe.thermalcorrener: 0.924791 hartree
zpe.thermalcorrenthalpy: 0.925735 hartree
zpe.thermalcorrgfe: 0.783569 hartree
zpe.sumelectzpe: -2562.012959 hartree
zpe.sumelectthermal: -2561.960151 hartree
zpe.sumelectthermalent: -2561.959207 hartree
zpe.sumelectthermalfe: -2562.101372 hartree
dipole: -4.5693 -2.6127 1.7400
dipole: 5.5437
quadrupole: -260.3763 -276.3931 -303.3918
quadrupole: 6.7461 -3.7314 -8.7372
quadrupole: 19.6774 3.6606 -23.3381 6.7461 -3.7314 -8.7372
hfenergy: -2562.8849414 hartree
pointgroup: C01 [X(C49H51Ir1N4P1)]
dipole: -1.6399088 -1.1149326 0.6507928 debye
polarizability: 671.9602255|37.7701163|605.8188537|22.5957892|-32.1944889|536.5038129 unknown
InChI: InChI=1/49C.Ir.4N.P.51H
charge 1 multiplicity 1
106 atoms
C  -2.20820927 -4.23918628 0.51454094
C  -1.40811918 -3.48681599 -0.35556819
C  -1.96057908 -2.78155147 -1.4350134
C  -3.32544275 -2.91666517 -1.67128027
C  -4.15685026 -3.66843069 -0.83976571
C  -3.57851175 -4.30162911 0.25573051
H  -4.20804942 -4.87426952 0.93266329
C  -5.62481067 -3.76899787 -1.11758619
H  -5.81616394 -4.30315735 -2.05278118
H  -6.15212765 -4.2990701 -0.32327813
H  -6.0823548 -2.78032888 -1.22431417
C  -1.65080167 -4.95083217 1.71113027
H  -2.41324078 -5.04295958 2.4867659
H  -1.32395964 -5.96770696 1.47080622
H  -0.79021518 -4.43204337 2.13952283
C  0.77163423 -4.63757673 -0.11834794
C  2.0481939 -4.26122449 0.10968475
H  0.33388768 -5.60809301 -0.27693079
H  2.9529243 -4.83697438 0.21112371
C  -1.14898143 -1.86563651 -2.29722366
H  -0.14362907 -2.2349216 -2.50389355
H  -1.64771007 -1.67416102 -3.25029051
H  -1.05656855 -0.8557247 -1.83909994
H  -3.75392363 -2.4067115 -2.53145788
N  0.00963619 -3.47579507 -0.14801049
N  2.04899365 -2.88148024 0.20728339
C  5.15727527 -0.98534986 -0.44703651
C  4.66473428 -0.8712837 1.89383099
H  5.78641291 -0.71702831 -1.29204458
C  4.03276995 -1.77491065 -0.67470133
C  3.67733241 -2.24202089 -2.05182032
H  4.31034686 -1.76618286 -2.80198984
H  3.79663808 -3.32498779 -2.16129226
H  2.63428598 -2.01177963 -2.29204255
C  3.2338452 -2.09489396 0.42616694
C  3.5303531 -1.66106235 1.72129162
C  2.64331412 -1.99186106 2.88245977
H  3.18504728 -1.91231536 3.82597374
H  1.79553563 -1.2979987 2.93628006
H  2.22792481 -3.00140085 2.81518311
H  4.91105765 -0.52192731 2.89363001
C  5.48948143 -0.52103377 0.82454588
C  6.71400309 0.31196087 1.04519144
H  6.51114397 1.15576377 1.70942564
H  7.51128542 -0.27574213 1.51134374
H  7.1063426 0.70677001 0.10631758
Ir 0.36385395 -0.36593338 -0.13019415
H  1.39037691 -0.07455836 0.99567761
H  1.5994622 -0.3318537 -1.11955371
C  0.79502948 -2.36777081 0.03725422
P  0.5053596 1.95626363 -0.38386617
C  2.28069477 2.42849986 -0.43001704
C  -0.16747315 2.73490361 -1.89516676
C  -0.15085007 2.96712697 0.99399119
C  2.88784898 3.15342917 0.59609245
C  3.05645986 2.00871382 -1.51700365
C  0.43345355 3.84800612 -2.49450654
C  -1.33319873 2.20879786 -2.45619144
C  -0.15291505 2.41662518 2.28062874
C  -0.65222426 4.25719328 0.80459688
C  4.24693864 3.45312709 0.53576345
H  2.3035284 3.49315712 1.44531693
C  4.40615603 2.32298317 -1.58168761
H  2.59766944 1.4363953 -2.31943233
C  -0.12533126 4.41760891 -3.63243957
H  1.34334644 4.26565121 -2.07323667
C  -1.89146455 2.78140132 -3.59312314
H  -1.81366164 1.35190629 -1.99040827
C  -0.65386893 3.14156368 3.35576484
H  0.22752021 1.40998389 2.43343324
C  -1.16076821 4.97727058 1.88048807
H  -0.66414464 4.69520412 -0.18912514
C  5.00618508 3.04444544 -0.55251863
H  4.7072184 4.01785661 1.34003911
H  4.99327308 2.00171077 -2.43646042
C  -1.28634137 3.88455122 -4.18473146
H  0.34948082 5.27836978 -4.09130714
H  -2.79868777 2.36231691 -4.01708977
C  -1.16591486 4.42090256 3.15586301
H  -0.64797201 2.70694145 4.35011023
H  -1.55309105 5.97666958 1.72225743
H  6.06242107 3.28829577 -0.60186009
H  -1.71600401 4.3283716 -5.07654886
H  -1.56375616 4.98448975 3.99318361
C  -1.30295037 -1.45904056 2.36511049
C  -2.51714705 -1.60234928 2.96506342
C  -3.312188 0.76113916 0.33877123
C  -4.02955951 0.32142843 -0.77780547
C  -3.27980756 2.12759095 0.63261745
C  -4.67082159 1.23399691 -1.60734614
H  -4.08378537 -0.74129637 -0.98486216
C  -3.91735693 3.03814459 -0.20281116
H  -2.76639116 2.47334769 1.52357506
C  -4.60838855 2.59492381 -1.32493355
H  -5.22414793 0.88154076 -2.47221329
H  -3.87653194 4.09699714 0.03067004
H  -5.1042458 3.30873044 -1.9743253
N  -1.40680636 -0.59652943 1.29869778
H  -2.84323227 -2.18199132 3.81326075
H  -0.36139664 -1.92147907 2.617189
C  -2.68033101 -0.2066015 1.25588459
N  -3.38410688 -0.80716325 2.25708855
C  -4.8131851 -0.696074 2.48595481
H  -5.35503144 -1.46784475 1.93223228
H  -5.01930182 -0.80828951 3.54943591
H  -5.16170412 0.28238809 2.15808133
