program: Gaussian 09
title: 000061009
version: EM64L-G09RevD.01
frameworkgroup: C1[X(C8H4N2O2)]
method: RPBEPBE
basis: SDD
operation: Freq
keyword: #pfreq=noraman
keyword: PBEPBE/SDD
title: #p freq=noraman PBEPBE/SDD
converged: NO YES NO NO
title: Mulliken charges:
elementType: O O N N C C C C C C C C H H H H
charge: -0.171499 -0.171526 0.075916 0.075924 0.389035 0.389032 -0.344187 -0.344186 -0.344186 -0.344186 -0.121034 -0.121024 0.257980 0.257981 0.257980 0.257981
chargesum: 0.00000
title: Mulliken charges with hydrogens summed into heavy atoms:
elementType: O O N N C C C C C C C C
charge: -0.171499 -0.171526 0.075916 0.075924 0.389035 0.389032 -0.086206 -0.086205 -0.086206 -0.086205 -0.121034 -0.121024
polarizability: 2.44184617e+02 -3.00953930e-05 8.06645489e+01 -5.17696245e-03 -3.54345697e-05 3.78548212e+01
1716.lowfreq: -63.1998 -40.6784 -9.5034 -6.4245 -0.0005 0.0004 0.0008 9.0461 37.9135
frequency: -63.1986 -40.6783 37.9135 85.7064 192.7178 314.4461 332.7669 381.6073 408.7760 435.4344 470.6242 473.0509 486.2784 487.1060 522.6716 573.9213 638.0599 724.8480 764.8711 823.8966 847.1098 960.6709 968.3113 998.2778 1091.6413 1105.9960 1106.1178 1183.0602 1295.9626 1337.8752 1416.4993 1429.3322 1501.0156 1552.0907 1560.7069 1624.3199 2386.4458 2403.8272 3153.0773 3153.8201 3171.9049 3176.5273
redmass: 9.3841 12.7094 11.5194 11.1797 10.2117 13.2053 10.3607 7.3899 2.9647 5.0480 10.9586 12.5533 12.6681 11.8037 2.5531 7.1915 7.2075 3.6726 6.8381 1.2455 1.6433 1.3778 1.3545 3.2447 7.7832 1.3561 2.8325 1.1334 1.2736 5.1143 2.5100 3.9449 12.3017 7.3896 6.4097 6.7171 12.7485 12.7330 1.0888 1.0886 1.0975 1.0986
irintensity: 0.0000 0.4712 1.4959 0.0001 0.6531 0.0000 8.9733 0.0003 0.0000 0.0000 20.2229 0.0030 33.3773 0.0477 31.2669 32.0221 0.0000 0.0000 0.0000 0.0001 99.5613 0.0000 0.0000 10.5603 0.0001 13.9280 162.9204 0.0000 0.0000 0.0315 119.7560 0.2388 0.0000 0.0000 56.5072 0.0000 3619.8564 0.0317 0.0000 14.2764 8.5064 0.0000
temp: 298.150 k
press: 1.00000 atm
elementType: 8 8 7 7 6 6 6 6 6 6 6 6 1 1 1 1
symmnumber: 1
zpe: 272624.7 jmol-1
zpe.correction: 0.103837 hartree
zpe.thermalcorrener: 0.112630 hartree
zpe.thermalcorrenthalpy: 0.113574 hartree
zpe.thermalcorrgfe: 0.068694 hartree
zpe.sumelectzpe: -566.387796 hartree
zpe.sumelectthermal: -566.379003 hartree
zpe.sumelectthermalent: -566.378059 hartree
zpe.sumelectthermalfe: -566.422939 hartree
dipole: 0.0003 0.0000 0.0045
dipole: 0.0045
quadrupole: -105.2925 -57.7992 -68.3751
quadrupole: 0.0001 0.0279 0.0001
quadrupole: -28.1369 19.3564 8.7805 0.0001 0.0279 0.0001
hfenergy: -566.4916332 hartree
pointgroup: C01 [X(C8H4N2O2)]
dipole: -0.0001312 -0.0017678 -0.0000026 debye
dipolederiv: -2.2395199 -0.000284 -0.0000051 0.0096891 -0.2704178 0.0000021 -0.0000106 0.0000022 -0.2695601 -2.2394127 -0.0004197 -0.0000062 -0.0002712 -0.2704212 0.0000021 -0.0000085 0.0000022 -0.269562 -2.5548691 0.0016902 -0.0000064 0.0033487 -0.1912993 -0.0002804 -0.0000127 -0.0002817 -0.3041475 -2.5548039 -0.0004051 -0.0000079 -0.0008264 -0.1912776 -0.0002805 -0.0000074 -0.0002818 -0.3041281 1.5247607 -0.0000214 0.0000034 0.0003972 0.1022042 0.0001231 0.0000013 0.0001269 0.153027 1.5247027 0.0002133 0.0000045 0.0005542 0.1021988 0.0001231 0.0000037 0.0001269 0.1530201 -0.1819743 0.000044 0.0059531 -0.0011566 -0.153829 0.0006645 -0.2052769 0.0006447 0.0525214 -0.1819554 0.0000364 -0.0059567 0.0007178 -0.153827 0.0007188 0.2052614 0.0007014 0.0525238 -0.1819754 0.0000201 -0.005954 -0.0001288 -0.15383 0.0003742 0.2052806 0.0003874 0.0525237 -0.1819529 0.00006 0.0059548 -0.0003107 -0.1538288 0.0003212 -0.205264 0.0003311 0.0525247 3.5653635 -0.0014421 0.0000089 -0.0124556 0.326103 0.0000298 0.0000197 0.0000295 0.3380047 3.5652276 0.0006751 0.0000108 0.0005259 0.326079 0.0000298 0.0000128 0.0000295 0.33798 0.0341013 0.000148 0.0720376 0.0001102 0.170536 -0.0005496 0.078274 -0.0005218 -0.0111813 0.0341035 -0.0002315 -0.0720365 -0.0001523 0.1705359 -0.0006328 -0.0782735 -0.0005505 -0.0111816 0.0341019 -0.0002133 -0.0720377 -0.0002855 0.1705366 -0.0003639 -0.0782735 -0.0003872 -0.0111831 0.0341024 0.0001301 0.0720375 0.0002439 0.1705372 -0.0002814 0.0782736 -0.0003588 -0.0111818 unknown
polarizability: 244.1846174|0.001207|37.8550872|0.0004409|0.1067307|80.6642828 unknown
InChI: InChI=1S/C8H4N2O2/c11-5-9-7-1-2-8(4-3-7)10-6-12/h1-4H
charge 0 multiplicity 1
16 atoms
O  -5.229997 -0.13357 0.000199
O  5.230162 -0.135569 0.00023
N  -2.801517 -0.138014 0.000206
N  2.801635 -0.13618 0.000221
C  -1.420717 -0.137415 0.000209
C  1.420837 -0.136615 0.000216
C  -0.702486 -0.133766 1.227575
C  0.702598 -0.133395 1.227578
C  -0.702478 -0.139883 -1.227154
C  0.702605 -0.139512 -1.227151
C  -4.00835 -0.138302 0.000203
C  4.008471 -0.135799 0.000225
H  -1.25382 -0.131042 2.172825
H  1.253924 -0.130345 2.172831
H  -1.253807 -0.141895 -2.172409
H  1.253939 -0.1412 -2.172403
