program: Gaussian 16
title: MePhIm TS
version: ES64L-G16RevC.01
method: RM06L
basis: GenECP
operation: Freq
keyword: #P
keyword: Geom=AllCheck
keyword: Guess=TCheck
keyword: SCRF=Check
keyword: GenChk
keyword: RM06L/GenECP
keyword: Freq
converged: YES YES YES YES
title: Mulliken charges:
elementType: Ir H P C C H H N N C H C C C C C C H H H H H C C C C C C H H C C C C C C H H C H H H C H H H C H H H C H H H C H H H C H H H C C C C H C H C H H H C C C H C H C H H H C C C C H C H C H H H C N C H C H C N C H H H
charge: 0.502634 -0.142875 0.640871 -0.023091 -0.035706 0.154437 0.151612 -0.345724 -0.351070 0.105189 -0.054979 0.093072 -0.305037 -0.141046 -0.102897 -0.110653 -0.148002 0.063424 0.129558 0.121748 0.122456 0.116572 0.045269 0.051059 0.047502 -0.181881 -0.210929 0.041405 0.104253 0.102513 0.046118 0.035385 0.035878 -0.168309 -0.168319 0.004232 0.103483 0.106512 -0.246725 0.127829 0.106857 0.121122 -0.254612 0.140914 0.107302 0.120299 -0.255440 0.125061 0.122065 0.127736 -0.241669 0.138651 0.109686 0.115766 -0.249263 0.136637 0.117487 0.123379 -0.252443 0.139574 0.114827 0.105507 -0.231572 -0.126084 -0.112518 -0.092324 0.142391 -0.104978 0.149043 -0.122542 0.123383 0.125802 0.126186 -0.099355 -0.103698 -0.090503 0.131831 -0.095435 0.167417 -0.106148 0.123109 0.133551 0.121617 -0.213107 -0.090151 -0.119672 -0.094546 0.132848 -0.103850 0.174146 -0.093823 0.124313 0.118977 0.126527 -0.230333 -0.495449 -0.080582 0.149801 -0.023772 0.140592 0.487855 -0.350937 -0.167069 0.132698 0.144724 0.136420
chargesum: 1.00000
title: Mulliken charges with hydrogens summed into heavy atoms:
elementType: Ir P C C N N C C C C C C C C C C C C C C C C C C C C C C C C C C C C C C C C C C C C C C C C C C C N C C C N C
charge: 0.368205 0.640871 0.131347 0.115906 -0.345724 -0.351070 0.105189 0.093072 -0.305037 -0.011488 0.018851 0.011804 -0.031430 0.045269 0.051059 0.047502 -0.077628 -0.108417 0.041405 0.046118 0.035385 0.035878 -0.064826 -0.061806 0.004232 0.109082 0.113903 0.119421 0.122434 0.128240 0.107466 -0.231572 0.016307 0.036525 0.031059 0.020825 0.003644 0.032476 0.063719 0.032606 0.038116 0.015468 -0.213107 0.042698 0.054474 0.029767 0.015127 0.032704 -0.230333 -0.495449 0.069219 0.116820 0.487855 -0.350937 0.246774
polarizability: 6.09799513e+02 7.34712660e+01 6.08777913e+02 1.98381621e+01 3.06963672e+01 5.82324604e+02
1716.lowfreq: -702.8090 -3.4249 -1.9400 -0.0006 0.0005 0.0007 3.7721 12.3607 18.9223
redmass: 1.0728 5.2072 4.3820 4.7462 5.0168 5.5809 4.2618 4.4067 4.1646 4.3632 4.5426 2.4701 2.3349 2.1051 4.5823 3.8568 3.6618 3.8537 2.2758 1.2773 2.8464 1.3838 3.1727 2.9748 1.5588 1.6311 2.3819 2.3078 2.7569 2.3270 1.5744 3.5723 3.9029 7.1121 4.8847 4.7598 3.2024 3.4835 4.3387 5.1104 4.7199 4.9695 2.9969 2.5166 2.5440 4.1712 4.4406 2.8264 2.8627 3.6864 4.3755 2.4920 2.4718 4.7173 3.2739 3.8756 3.1268 3.3943 4.3418 4.3136 5.9620 5.0500 2.8897 2.9383 2.9682 4.8283 4.7217 5.7332 3.3702 5.6120 4.0516 3.3608 3.4326 5.8594 3.3649 3.1865 3.7737 3.7538 4.2279 5.9538 4.0793 4.1162 3.9691 3.9772 3.5367 4.0837 3.0379 3.8953 2.7737 3.5859 3.6135 5.8055 5.1483 3.8808 5.1040 4.4770 5.7831 3.1067 2.0501 2.1781 2.1269 3.6238 2.1186 1.6996 3.8279 1.8685 2.7692 1.8359 4.2198 1.8508 3.5703 1.9162 1.5858 1.4831 2.3352 1.2891 1.2717 1.1290 1.2347 1.2506 1.2850 1.2589 1.2666 1.2481 1.2942 1.2958 1.0840 1.1008 1.2962 1.3105 1.3416 1.4997 2.9467 2.2898 2.1441 2.4655 5.1066 1.3741 3.7000 1.3594 1.3135 1.3377 4.0343 1.2581 1.2798 1.2718 6.6574 6.1197 6.1097 6.1978 1.7339 1.7080 4.5058 1.5736 1.5806 1.5821 1.5395 1.5585 1.5617 1.6893 2.6428 1.5435 2.6715 2.6868 1.9607 1.9878 2.0099 1.6634 1.8559 1.6208 2.6885 1.3089 1.5299 1.5931 2.6991 2.7811 2.9096 2.6316 1.3155 1.7200 1.0824 1.0817 1.0821 1.0813 1.5266 1.7073 1.4507 1.1333 1.1359 1.1350 2.2308 1.3631 1.3540 2.8088 6.6882 1.6779 1.6349 1.6144 3.3056 4.8325 3.4925 1.7243 3.2685 9.5322 6.2548 3.7039 5.9456 4.7325 4.6614 5.3328 4.4788 1.2758 1.2579 1.2601 1.2829 1.4758 1.4784 1.3967 2.6802 1.8704 1.9324 1.9507 1.8354 1.6370 1.4063 2.2285 2.2963 1.1006 2.0301 1.0572 1.0649 1.0576 1.0436 1.0635 1.0502 1.0957 1.0755 1.1814 1.5480 1.5720 2.0900 2.0884 2.1002 3.4957 2.5156 2.5082 4.7268 4.8165 5.2019 5.1351 5.3692 5.6113 5.5771 5.8040 5.6812 5.6256 5.6555 7.6352 7.8681 6.0478 6.0055 1.0150 1.0134 1.0116 1.0388 1.0391 1.0385 1.0400 1.0400 1.0380 1.0345 1.0990 1.0991 1.0968 1.0988 1.0965 1.0995 1.1058 1.1017 1.1021 1.1012 1.0975 1.0939 1.1004 1.1010 1.0904 1.0854 1.0870 1.0906 1.0906 1.0876 1.0856 1.1027 1.0848 1.0875 1.0890 1.0865 1.0890 1.0902 1.0904 1.0946 1.0948 1.0948 1.0964 1.0991 1.0993 1.0993 1.0901 1.0900 1.0901 1.1088 1.1123
irintensity: 187.9712 0.0452 0.0436 0.1673 0.2444 0.3875 0.5023 0.2529 0.0958 0.6885 0.6040 0.3719 0.5485 0.3825 0.0166 0.6196 0.1880 0.1565 0.2955 0.3499 1.0662 0.2131 0.3718 0.6077 0.2605 0.1536 1.2034 0.1210 0.6181 0.3390 0.2518 0.1464 0.0864 0.0077 1.0479 2.6214 1.3671 8.6980 1.0905 0.2930 1.8830 0.2543 0.0449 0.0852 0.8799 2.6016 0.4459 0.0186 0.6947 0.5950 0.4445 0.2262 0.1699 0.0359 0.0780 0.2551 1.0797 0.5068 0.4336 0.7856 0.8125 0.8172 0.0294 0.3028 0.0642 4.3488 5.2230 6.2970 4.0598 9.7116 1.1167 0.5663 2.3470 27.3777 2.5339 0.3748 32.2966 25.1879 2.5846 104.7437 0.2920 3.6998 1.0474 3.5137 5.5412 3.6516 2.9740 0.3889 5.6480 3.3799 3.9568 2.1873 0.8666 2.1046 0.0810 7.1902 11.0453 23.9213 9.4048 47.3979 61.2004 33.1477 19.9103 16.3834 12.7673 7.3176 4.8665 11.6353 3.6035 7.6120 10.2029 5.6860 42.1090 20.4009 14.1463 0.0835 0.4891 10.8094 4.9830 20.0653 3.2033 18.6177 2.5614 2.6717 0.7306 0.4079 79.3986 52.0944 1.7448 0.4619 2.9029 11.3981 19.1237 1.1475 2.6376 2.0299 4.0668 0.1379 3.5321 0.3667 0.7851 0.5897 1.2667 0.4607 0.0011 0.0220 14.6699 6.6000 6.8262 2.4230 12.5595 2.5835 2.2958 0.4934 0.8158 7.7702 5.0553 15.6851 3.9242 3.2905 0.3535 2.0461 0.7843 1.5681 0.0328 1.8897 0.6833 5.6507 1.9479 2.1948 6.0819 2.3884 2.8995 4.9235 22.5376 32.1046 11.6436 2.5153 0.2735 7.1864 0.3697 0.0353 0.3286 1.3894 2.0577 10.8498 0.2533 1.4367 4.1511 0.4311 40.1189 0.1503 0.3128 1.4991 22.0150 3.6750 0.8231 7.3867 0.6764 0.9347 7.8766 2.3090 1.2979 44.3092 4.2999 0.0564 1.1888 0.1954 0.4894 0.5289 4.4898 0.9379 6.5098 7.4996 2.9765 9.8457 6.7405 2.6057 90.0121 0.7883 1.6767 1.1204 1.9022 6.6285 5.0741 28.7773 10.1773 4.9175 3.5706 2.0390 1.9337 23.7967 5.9777 14.0904 12.7348 2.5658 0.3074 11.4202 7.1192 27.8774 4.1139 4.3816 13.9954 59.3211 98.6723 0.9946 3.3768 29.5347 2.9214 2.8580 0.0905 0.3425 0.7990 8.3753 0.6269 0.0373 0.3305 2.9533 6.9046 21.6780 14.7101 103.0319 93.4613 26.6811 21.8771 18.9664 28.9232 23.8158 7.0866 22.9093 24.3761 8.0575 13.5649 12.5944 10.4455 9.8294 10.6373 3.2182 7.9792 8.7946 6.5815 13.3575 18.9033 11.7926 5.9947 13.1133 0.9056 3.2904 6.6429 9.2272 0.7377 1.9512 2.8136 1.5962 1.3815 1.3328 0.6764 3.8816 1.4256 3.3190 10.6073 4.9139 17.6940 12.3192 13.2529 19.8923 17.2764 5.1322 3.6526 4.7067 0.0817 1.7734
temp: 298.150 k
press: 1.00000 atm
elementType: 77 1 15 6 6 1 1 7 7 6 1 6 6 6 6 6 6 1 1 1 1 1 6 6 6 6 6 6 1 1 6 6 6 6 6 6 1 1 6 1 1 1 6 1 1 1 6 1 1 1 6 1 1 1 6 1 1 1 6 1 1 1 6 6 6 6 1 6 1 6 1 1 1 6 6 6 1 6 1 6 1 1 1 6 6 6 6 1 6 1 6 1 1 1 6 7 6 1 6 1 6 7 6 1 1 1
symmnumber: 1
zpe: 2280134.5 jmol-1
zpe.correction: 0.868457 hartree
zpe.thermalcorrener: 0.921500 hartree
zpe.thermalcorrenthalpy: 0.922444 hartree
zpe.thermalcorrgfe: 0.779610 hartree
zpe.sumelectzpe: -2561.992896 hartree
zpe.sumelectthermal: -2561.939854 hartree
zpe.sumelectthermalent: -2561.938910 hartree
zpe.sumelectthermalfe: -2562.081744 hartree
dipole: -0.5318 -3.0096 -3.3959
dipole: 4.5687
quadrupole: -280.6283 -281.8595 -284.4936
quadrupole: 7.8709 14.1916 13.0307
quadrupole: 1.6988 0.4677 -2.1665 7.8709 14.1916 13.0307
hfenergy: -2562.8613538 hartree
pointgroup: C01 [X(C49H51Ir1N4P1)]
dipole: -0.0845759 -1.1124812 -1.1681765 debye
polarizability: 609.7995127|73.471266|608.777913|19.8381621|30.6963672|582.3246043 unknown
InChI: InChI=1/49C.Ir.4N.P.51H
charge 1 multiplicity 1
106 atoms
Ir 0.37313667 -0.03244768 0.18965202
H  1.55263237 0.96907742 -0.31418398
P  -1.08430962 1.83645263 0.12677355
C  3.99716552 -2.24897636 0.85663986
C  3.22716858 -3.28251376 0.45264749
H  5.02500546 -2.20358604 1.17575984
H  3.43672389 -4.33332934 0.3415494
N  3.20441161 -1.11582266 0.80584786
N  1.97758454 -2.75809259 0.16441589
C  1.94391657 -1.41085315 0.3716368
H  0.85281372 0.57228134 1.58967793
C  -1.91864339 -1.6962177 -0.96692436
C  -1.4873016 -1.24969136 0.31857564
C  -2.33774212 -1.50629342 1.40057798
C  -3.53800601 -2.19588048 1.25906165
C  -3.93247558 -2.64727327 0.0067203
C  -3.13139555 -2.38653885 -1.09386294
H  -0.25642155 -0.92788496 1.35749922
H  -2.05620869 -1.16522278 2.39285774
H  -4.15900212 -2.37787269 2.1302244
H  -4.86494845 -3.18714855 -0.11847996
H  -3.47099537 -2.71707918 -2.06646179
C  0.88009149 -3.5726208 -0.28111302
C  -0.01619 -4.0737464 0.67215262
C  0.78813835 -3.88810487 -1.63736433
C  -1.06487206 -4.86574337 0.21724478
C  -0.28380886 -4.6863445 -2.04193614
C  -1.22318037 -5.1734414 -1.13594891
H  -1.7843596 -5.24606036 0.93822076
H  -0.37282108 -4.94489703 -3.09519858
C  3.67834461 0.1815738 1.20909661
C  3.54229982 0.5537913 2.54968303
C  4.25969694 1.01181035 0.25005986
C  3.99964489 1.81714109 2.91547732
C  4.7005622 2.26753054 0.6667118
C  4.58167484 2.68732518 1.99107672
H  3.90247311 2.12847448 3.95256196
H  5.14996546 2.93390291 -0.06542447
C  4.38946243 0.56578278 -1.17259243
H  5.0815372 -0.27707522 -1.27117928
H  3.42538906 0.22947952 -1.56802428
H  4.75800241 1.37179243 -1.80766896
C  5.08560725 4.02964546 2.42511213
H  5.99516937 3.93227106 3.02568563
H  5.32702454 4.66734978 1.57298799
H  4.3546552 4.5526528 3.0474232
C  2.92085463 -0.373476 3.54780888
H  3.47122395 -1.31670322 3.62450382
H  2.89442664 0.0767621 4.54037346
H  1.89481271 -0.63232306 3.26562056
C  1.81925726 -3.42289328 -2.61853907
H  2.7029818 -4.07004679 -2.59543577
H  1.43256311 -3.4441309 -3.63888469
H  2.16390908 -2.40798961 -2.40667624
C  0.16712923 -3.79478534 2.13168212
H  1.01829446 -4.35348222 2.53629165
H  0.36935935 -2.7384333 2.32981045
H  -0.71748591 -4.08346236 2.70044119
C  -2.38192663 -6.00500948 -1.59167414
H  -2.37079942 -6.99511213 -1.12773225
H  -3.33331514 -5.54084667 -1.31194792
H  -2.37999338 -6.14853444 -2.67380387
C  -2.21016416 1.75807029 -1.30565259
C  -1.76172388 2.18967623 -2.55933307
C  -3.44168778 1.1012921 -1.21362185
C  -2.53995881 1.98994924 -3.69256235
H  -0.79899437 2.68638567 -2.64660007
C  -4.21854559 0.90385319 -2.34992231
H  -3.79144835 0.73375654 -0.25275358
C  -3.7718884 1.34980294 -3.58963447
H  -2.18541853 2.3397676 -4.65663956
H  -5.17668178 0.4012187 -2.26153737
H  -4.38490864 1.2051842 -4.47363409
C  -0.95218324 4.57384194 -0.49585231
C  1.04214959 3.6327745 0.48343654
C  -0.3502798 5.82510266 -0.51898141
H  -1.96449854 4.46053122 -0.87303447
C  1.6373892 4.8894605 0.46401108
H  1.59195971 2.7821572 0.87344075
C  0.94627868 5.98503511 -0.03979202
H  -0.89545509 6.67687439 -0.9113184
H  2.64822751 5.00704559 0.84047504
H  1.4145312 6.96340419 -0.05896967
C  -2.16869424 2.06769768 1.58211966
C  -3.34472811 2.82069154 1.49025311
C  -1.77149955 1.58114873 2.82984327
C  -4.11619789 3.05950485 2.6202029
H  -3.66382565 3.21929483 0.5319039
C  -2.54256702 1.82716087 3.96026119
H  -0.8512738 1.01098113 2.91442118
C  -3.71808278 2.56153821 3.85672888
H  -5.02860661 3.63990153 2.53483296
H  -2.22276473 1.44491173 4.92397775
H  -4.32100937 2.75112625 4.73826566
C  -0.25652004 3.46314599 -0.00385224
N  -0.01367719 -0.55735581 -1.87999664
C  0.54023489 -0.25595668 -3.08920265
H  1.42368197 0.35547864 -3.17735612
C  -0.21203849 -0.8382825 -4.06648062
H  -0.11810332 -0.84607731 -5.13989548
C  -1.10128662 -1.30411245 -2.09347074
N  -1.24284116 -1.50044042 -3.43718249
C  -2.26127321 -2.25428926 -4.14307376
H  -2.29443084 -3.28543243 -3.78477528
H  -3.24280301 -1.79144788 -4.02139156
H  -2.00939617 -2.26157244 -5.20215095
