program: Gaussian 16
title: TS_PhOx_CHAct_30
version: ES64L-G16RevC.01
method: RM06L
basis: GenECP
operation: Freq
keyword: #P
keyword: Geom=AllCheck
keyword: Guess=TCheck
keyword: SCRF=Check
keyword: GenChk
keyword: RM06L/GenECPFreq
converged: YES YES YES YES
title: Mulliken charges:
elementType: Ir H P C C H H N N C H C C C C C C H H H H H C C C C C C H H C C C C C C H H C H H H C H H H C H H H C H H H C H H H C H H H C C C C H C H C H H H C C C H C H C H H H C C C C H C H C H H H C N C H C H C O H H
charge: 0.427774 -0.133552 0.634981 -0.023412 -0.037563 0.156257 0.152946 -0.344722 -0.354097 0.120585 -0.003994 0.038567 -0.310207 -0.132188 -0.100878 -0.096386 -0.115747 0.099638 0.125221 0.125319 0.127918 0.132182 0.067810 0.026616 0.036162 -0.194527 -0.226932 0.057084 0.107370 0.109026 0.059095 0.021515 0.033885 -0.180314 -0.187581 0.031496 0.103400 0.107605 -0.262126 0.119055 0.145081 0.122958 -0.252394 0.130600 0.129919 0.111784 -0.246871 0.122312 0.113822 0.131837 -0.263001 0.138153 0.119986 0.125076 -0.246421 0.144843 0.110273 0.125460 -0.261054 0.126964 0.117545 0.129449 -0.222370 -0.156253 -0.145763 -0.104530 0.149035 -0.078203 0.147137 -0.116287 0.130103 0.127144 0.130397 -0.092311 -0.086609 -0.094887 0.132018 -0.104330 0.168682 -0.095262 0.125059 0.118362 0.125405 -0.209892 -0.097116 -0.111042 -0.090341 0.135137 -0.110224 0.170734 -0.094327 0.125579 0.117147 0.127161 -0.244626 -0.514995 -0.121742 0.142235 -0.016720 0.147227 0.468370 -0.352324 0.143549 0.136070
chargesum: 1.00000
title: Mulliken charges with hydrogens summed into heavy atoms:
elementType: Ir P C C N N C C C C C C C C C C C C C C C C C C C C C C C C C C C C C C C C C C C C C C C C C C C N C C C O
charge: 0.389866 0.634981 0.132845 0.115383 -0.344722 -0.354097 0.120585 0.038567 -0.310207 -0.006967 0.024441 0.031531 0.016435 0.067810 0.026616 0.036162 -0.087157 -0.117906 0.057084 0.059095 0.021515 0.033885 -0.076914 -0.079976 0.031496 0.124967 0.119909 0.121099 0.120214 0.134154 0.112905 -0.222370 -0.007218 0.001374 0.025573 0.048941 0.014110 0.039707 0.082073 0.030172 0.014032 0.030143 -0.209892 0.038022 0.059692 0.035238 0.006923 0.032834 -0.244626 -0.514995 0.164042 0.266578 0.468370 -0.352324
polarizability: 6.66826025e+02 8.40745929e+00 5.34200250e+02 1.53089316e+01 -1.44895674e+01 5.60622523e+02
1716.lowfreq: -689.5495 -2.9262 -0.0002 0.0007 0.0010 1.7651 2.3538 11.7704 17.9358
redmass: 1.0848 5.2365 4.9585 3.9788 5.0479 5.5380 4.9373 4.4072 4.8538 4.4757 4.3650 4.2427 3.9728 3.7612 3.9430 1.4160 2.4819 3.4807 1.1761 4.2625 4.6668 1.1491 3.5063 3.7274 1.1653 4.4090 3.1778 3.0328 2.0455 2.9182 2.3641 2.6566 6.3148 3.1567 4.3362 3.0624 2.2067 2.0692 3.5953 2.9032 4.8878 4.8748 3.5776 4.0362 3.2260 4.6287 5.0204 4.3200 5.6369 4.9619 2.5015 2.4527 4.7910 3.5139 3.6947 2.9146 4.2114 3.9324 5.3911 4.9363 2.9009 2.9224 3.0307 4.9203 4.6434 5.9155 3.5845 5.5172 4.5209 4.0231 4.2168 3.3642 3.3741 5.5449 3.2597 4.3460 3.1334 5.9677 2.8567 3.8784 3.7960 4.0036 3.7024 1.7552 3.7558 3.0337 6.3531 6.3817 6.3661 6.0825 4.7092 5.1368 4.8924 5.6572 3.4492 2.4594 2.4713 1.9884 3.5352 2.8223 3.1935 1.7143 1.7928 4.3888 1.6057 1.5618 3.3156 1.8321 1.8103 6.9580 1.9387 1.2893 1.1993 1.1380 1.2413 1.2338 1.2513 1.2464 1.2408 1.2777 1.1257 1.2900 1.2879 1.0873 1.3132 1.3100 1.3161 6.0701 3.8401 2.1922 2.4649 2.2362 5.0517 1.4027 2.3910 1.7212 1.3628 4.0545 1.3492 1.2978 1.2785 1.2783 1.2744 3.6288 5.9155 6.0888 6.1946 5.9981 1.7693 1.6549 1.5260 1.6248 1.5686 1.5711 1.5475 1.5994 2.2698 1.9706 2.2586 2.8147 1.6361 1.9185 3.4725 2.1122 2.7803 1.8559 1.6290 2.6378 1.6055 1.6621 1.6136 2.6569 2.0972 2.7878 2.8266 2.7426 2.0150 1.0831 1.0824 1.0805 1.1408 1.5243 1.4455 1.1379 1.1345 1.1353 1.1247 2.1216 1.0982 1.3586 1.3628 1.5446 6.2789 1.6366 1.6721 1.8987 2.5266 1.5196 3.3162 5.7286 9.6829 2.8020 2.2013 6.1531 3.5412 4.3315 4.3571 4.0839 1.2581 1.2659 1.2411 1.3085 1.4747 1.4783 2.7732 2.4822 1.8987 1.9348 2.0218 2.1580 1.4743 1.3524 2.1583 1.3137 1.5889 1.0609 1.0498 1.0537 1.0505 1.0747 1.1353 1.0820 1.0761 1.2997 1.5928 1.5611 2.0791 2.0773 2.0750 2.4710 2.4472 2.5392 5.2649 5.2063 5.3462 5.5814 5.5392 5.7169 5.6357 5.5926 5.6255 7.7546 7.5916 6.0479 6.0100 8.5023 1.0148 1.0135 1.0119 1.0396 1.0391 1.0391 1.0405 1.0401 1.0389 1.0637 1.0591 1.1015 1.0979 1.0994 1.0987 1.0961 1.0971 1.0986 1.1107 1.1009 1.1014 1.1020 1.1005 1.1020 1.1004 1.0908 1.0906 1.0904 1.0875 1.0906 1.0871 1.0860 1.0850 1.0870 1.0864 1.0879 1.0862 1.0902 1.0925 1.0910 1.0915 1.0946 1.0942 1.0922 1.0992 1.0984 1.0991 1.0978 1.0902 1.1124
irintensity: 189.9613 0.0759 0.2720 0.0655 0.0231 0.4007 0.1317 0.1535 0.1758 0.5650 0.3625 0.2571 0.1823 0.2877 0.4128 0.4087 0.1007 0.1963 0.3993 0.4239 0.7502 0.2264 0.4158 0.2536 0.4245 1.0495 1.4061 0.1774 0.0879 0.9318 0.5727 0.1558 0.2824 0.9756 0.8655 2.5883 3.6417 1.5491 0.9986 4.5306 1.7858 1.1701 0.2360 1.1547 0.0153 1.1073 0.0797 0.3451 0.5840 0.3883 0.1909 0.1516 0.0445 1.1605 0.5106 0.3974 1.2785 0.4029 1.1358 0.2339 0.0042 0.2467 0.1114 5.4234 3.9506 6.4065 1.4900 11.4963 2.8789 0.6282 3.9832 0.9322 2.7327 22.0664 6.8303 45.6898 0.9934 104.0968 16.8390 2.0978 2.2089 3.1277 7.0362 16.5731 1.4174 1.4464 0.1400 0.1742 0.9134 0.3876 0.2936 0.4171 21.0812 10.3299 12.1180 11.8043 14.4868 61.3618 39.3647 9.5650 11.3343 13.4464 18.9644 1.3610 26.8056 43.2696 3.7915 9.9366 3.2332 1.3116 11.4707 0.0779 1.5823 10.0074 1.2110 1.3849 25.6717 18.9328 2.0887 7.5288 104.7074 0.6603 5.4860 16.2134 0.1015 0.1638 0.5171 1.0373 26.0330 3.8073 3.1453 1.2132 47.4787 5.7045 2.5167 1.5882 0.2672 1.4987 0.1682 0.3770 0.1765 0.1277 0.0218 3.1520 1.9579 2.2872 8.1700 19.0040 8.1985 3.9044 0.7435 0.9404 0.8457 13.5471 2.4683 7.9241 0.6680 1.2225 1.5675 0.4692 0.8012 0.0363 2.6029 0.1065 14.4193 2.9010 2.2410 7.4864 2.2337 1.2710 3.3479 19.4299 24.0098 28.8877 15.7669 2.6578 28.1025 0.3961 0.1123 0.3056 0.7209 2.1043 0.0862 2.2232 0.4695 1.3248 0.9565 35.3628 1.6190 0.0361 0.4369 9.6791 21.8599 19.8364 0.8364 5.3105 4.2609 1.6776 1.9696 6.6514 42.0346 2.8336 6.4943 3.1949 0.1407 0.3800 0.3545 2.2401 1.3218 4.6162 8.0812 6.7873 9.1074 1.7086 70.0307 64.5328 0.3309 3.3499 10.1069 4.6147 6.8041 1.5446 36.6067 6.0988 7.3422 6.1435 12.2719 10.4232 16.7547 0.8683 0.0873 0.8449 1.7156 6.0553 12.9168 24.2659 3.6437 4.6407 9.1222 83.7583 98.8840 22.5691 8.0096 2.5621 0.0551 0.0081 0.8967 16.5472 0.8121 0.3684 0.0442 0.8081 9.8613 30.1525 8.2619 85.2007 132.6717 46.3268 18.2364 12.0842 23.8707 20.5808 21.2424 12.9401 19.7970 18.3496 34.2730 13.2768 15.4340 2.1664 11.1880 13.5603 10.1488 13.3343 13.6345 8.8127 15.0909 6.4785 7.4587 3.6650 9.7693 15.1767 6.9811 14.1748 3.0552 8.9528 4.5820 0.2757 0.8008 0.8557 3.3437 0.0439 0.1255 0.8179 7.0252 3.2660 11.6123 10.2236 10.9159 1.3808 11.4250 18.6861 12.7497 12.9524 4.9680 2.1631
temp: 298.150 k
press: 1.00000 atm
elementType: 77 1 15 6 6 1 1 7 7 6 1 6 6 6 6 6 6 1 1 1 1 1 6 6 6 6 6 6 1 1 6 6 6 6 6 6 1 1 6 1 1 1 6 1 1 1 6 1 1 1 6 1 1 1 6 1 1 1 6 1 1 1 6 6 6 6 1 6 1 6 1 1 1 6 6 6 1 6 1 6 1 1 1 6 6 6 6 1 6 1 6 1 1 1 6 7 6 1 6 1 6 8 1 1
symmnumber: 1
zpe: 2236078.7 jmol-1
zpe.correction: 0.851677 hartree
zpe.thermalcorrener: 0.903538 hartree
zpe.thermalcorrenthalpy: 0.904482 hartree
zpe.thermalcorrgfe: 0.763852 hartree
zpe.sumelectzpe: -2543.759115 hartree
zpe.sumelectthermal: -2543.707254 hartree
zpe.sumelectthermalent: -2543.706310 hartree
zpe.sumelectthermalfe: -2543.846940 hartree
dipole: 1.4994 -1.0969 0.8692
dipole: 2.0511
quadrupole: -270.1365 -279.0500 -290.5739
quadrupole: 0.1909 11.1307 -0.8071
quadrupole: 9.7837 0.8701 -10.6538 0.1909 11.1307 -0.8071
hfenergy: -2544.610792 hartree
pointgroup: C01 [X(C48H50Ir1N3O1P1)]
dipole: 0.4385582 -0.4560895 0.3804164 debye
polarizability: 666.8260249|8.4074593|534.20025|15.3089316|-14.4895674|560.6225227 unknown
InChI: InChI=1/48C.Ir.3N.O.P.50H
charge 1 multiplicity 1
104 atoms
Ir -0.14708991 -0.33837967 -0.02870856
H  -1.2000706 -0.56258049 1.19836803
P  -0.66819882 1.96728238 0.05106909
C  -1.00150127 -4.51679529 -0.59751166
C  0.30433827 -4.65854505 -0.28313206
H  -1.7553162 -5.23662383 -0.86952858
H  0.93771828 -5.5275656 -0.2190166
N  -1.28682699 -3.16474304 -0.51819081
N  0.7886989 -3.38778258 -0.02044759
C  -0.18246942 -2.44311844 -0.15841297
H  -1.51283987 -0.41227291 -0.83557141
C  2.76596539 0.38501651 -0.51403964
C  1.5985757 0.23276057 -1.30534278
C  1.718043 0.58181778 -2.65718418
C  2.92117959 1.02507297 -3.19934874
C  4.06049215 1.13777807 -2.40622647
C  3.97543108 0.82652455 -1.05949977
H  0.15650103 -0.47475483 -1.5910292
H  0.85452459 0.51043063 -3.31311446
H  2.96682687 1.27892399 -4.25364066
H  4.99663025 1.47963714 -2.83293969
H  4.8328822 0.9391986 -0.4020253
C  2.12372369 -3.14277828 0.44544778
C  3.12865421 -2.82150524 -0.46757294
C  2.35910664 -3.26485045 1.81940537
C  4.39883877 -2.55792922 0.04713038
C  3.64434559 -2.99444927 2.28022677
C  4.67312086 -2.62132691 1.41168242
H  5.19252801 -2.28135444 -0.64306709
H  3.8498859 -3.08161422 3.34504855
C  -2.60308302 -2.63305659 -0.7530223
C  -2.947634 -2.23385794 -2.04902154
C  -3.47976414 -2.52395962 0.32736006
C  -4.20850803 -1.67538023 -2.23712628
C  -4.73671678 -1.96976214 0.08218494
C  -5.11507631 -1.52769657 -1.18401974
H  -4.49310745 -1.34943062 -3.23465804
H  -5.43668807 -1.87919464 0.90944624
C  -3.07315448 -2.95302333 1.70218052
H  -2.6789484 -3.97370504 1.71551903
H  -2.28207726 -2.30372879 2.09350847
H  -3.9151364 -2.90936556 2.39347564
C  -6.45253994 -0.89523339 -1.41413183
H  -6.350035 0.17605326 -1.61514296
H  -6.96027823 -1.33043225 -2.2782358
H  -7.1071293 -1.00674563 -0.54846901
C  -1.9781413 -2.37676477 -3.18098534
H  -2.40100689 -1.99936181 -4.11268661
H  -1.04908593 -1.82869645 -2.98467993
H  -1.69186701 -3.42030621 -3.34465526
C  1.25980961 -3.67505454 2.7515498
H  0.96650028 -4.71813069 2.59326995
H  1.56876837 -3.58117684 3.79381872
H  0.35523654 -3.07546678 2.60339866
C  2.87742105 -2.77725178 -1.94325354
H  3.10757109 -3.74393188 -2.40450229
H  1.83786378 -2.54485113 -2.1831119
H  3.51046411 -2.02963815 -2.42625925
C  6.02704045 -2.25635507 1.93477822
H  6.14440474 -1.16717473 1.96556411
H  6.18809365 -2.63221173 2.94659026
H  6.82579391 -2.64316026 1.29869722
C  0.54622299 2.92994803 1.00866552
C  0.35060189 3.15524717 2.37595084
C  1.76948083 3.2888083 0.42905729
C  1.35131452 3.74386464 3.14164271
H  -0.59146013 2.87735554 2.84076264
C  2.76941539 3.86999872 1.19979052
H  1.94118266 3.11359744 -0.62923228
C  2.56220427 4.10130232 2.55588911
H  1.18065615 3.93020447 4.19707899
H  3.71176317 4.14366584 0.73649718
H  3.34001178 4.56454589 3.15381372
C  -2.59350728 3.71875013 1.07357377
C  -3.30408543 1.42118684 0.87454557
C  -3.85981451 4.07248666 1.51808956
H  -1.82754366 4.48303585 0.97231629
C  -4.57543295 1.78352581 1.30852633
H  -3.09426639 0.38664227 0.6243145
C  -4.85389123 3.10473598 1.63597205
H  -4.07353793 5.10632384 1.76710577
H  -5.34759011 1.02510461 1.39221495
H  -5.84416014 3.38437375 1.97934712
C  -0.77264719 2.76917482 -1.59243687
C  -0.36952747 4.08941096 -1.81092913
C  -1.36755378 2.0598679 -2.64163899
C  -0.52419442 4.67297461 -3.06374681
H  0.06797386 4.66916014 -1.00459561
C  -1.53062642 2.65010491 -3.88821436
H  -1.70780184 1.04042778 -2.4803325
C  -1.09913458 3.9545939 -4.10541537
H  -0.1987938 5.69559501 -3.22202399
H  -1.99528617 2.08930053 -4.69270167
H  -1.2196338 4.41301823 -5.08100781
C  -2.30086787 2.38555419 0.75957687
N  1.49494652 -0.15963345 1.42384015
C  1.62353492 -0.12760469 2.87517725
H  0.90962287 0.58926774 3.29475782
C  3.08426821 0.29407869 3.09127133
H  3.19365873 1.24954748 3.60788771
C  2.6251896 0.1955555 0.90865985
O  3.62270969 0.46563189 1.75139067
H  1.39770469 -1.10737835 3.3046365
H  3.69105282 -0.46284057 3.59212497
