program: Gaussian 16
title: 1-phenylpyrazole
version: ES64L-G16RevC.01
method: RM06L
basis: GenECP
operation: Freq
keyword: #P
keyword: Geom=AllCheck
keyword: Guess=TCheck
keyword: SCRF=Check
keyword: GenChk
keyword: RM06L/GenECP
keyword: Freq
converged: YES YES YES YES
title: Mulliken charges:
elementType: C C C C C C H H H H H N C C H C H H N
charge: -0.102633 -0.113971 0.263089 -0.144286 -0.109984 -0.108599 0.112818 0.143939 0.115436 0.109641 0.109122 -0.280422 0.138219 -0.351573 0.123634 0.132758 0.113275 0.110646 -0.261110
chargesum: -0.00000
title: Mulliken charges with hydrogens summed into heavy atoms:
elementType: C C C C C C N C C C N
charge: 0.010185 0.029967 0.263089 -0.028850 -0.000343 0.000523 -0.280422 0.261853 -0.238298 0.243405 -0.261110
chargesum: 0.00000
polarizability: 1.69444468e+02 -2.38543925e-01 1.09122328e+02 1.23386677e-01 -2.34002873e-01 4.71881758e+01
1716.lowfreq: -4.1516 -0.0009 -0.0006 -0.0005 1.6560 7.0165 36.6444 106.5978 187.1933
frequency: 36.6381 106.5971 187.1930 269.9466 375.8092 413.0160 457.4696 515.6219 622.9752 630.0420 665.9791 702.5009 703.0087 744.1867 764.5107 826.3804 838.6388 884.5054 910.7669 926.8738 949.2412 970.9190 993.1004 1019.5900 1048.3178 1060.8690 1067.7873 1107.3735 1148.3068 1180.0056 1198.0923 1220.4529 1277.7157 1346.7741 1368.1420 1389.9663 1443.8302 1457.1393 1499.6345 1537.3525 1567.8320 1649.6279 1659.7316 3164.2321 3173.3463 3187.0035 3195.2972 3217.8827 3225.3813 3251.4339 3271.5311
redmass: 3.9815 4.5725 4.3087 4.6975 6.7784 3.0150 4.6706 3.1774 3.2304 5.6843 6.1725 2.2158 5.7429 1.2891 1.7453 1.2512 1.2504 1.3095 1.3998 5.8613 3.5301 1.3342 1.2545 5.9104 2.9882 1.6325 1.4520 1.5551 2.2306 1.0784 1.1496 1.5114 3.1788 1.5196 3.5572 7.2737 4.2325 3.6953 2.6333 2.7359 4.5205 6.5553 5.9446 1.0841 1.0893 1.0935 1.0970 1.0929 1.0926 1.0927 1.1072
irintensity: 2.2212 0.9630 1.4412 0.6097 1.6980 0.1763 1.7119 6.9438 1.9139 0.2615 9.9719 15.6831 15.9089 51.4726 59.4854 6.2889 1.1540 2.9136 6.3371 4.6612 31.0115 0.5024 0.4189 0.8972 2.4995 25.5128 23.7719 7.5584 7.9138 0.6062 0.0578 12.1945 9.5167 9.6889 15.6478 0.1795 86.8319 12.0794 3.4622 80.2542 57.2545 3.4344 57.7102 1.4190 12.6697 25.9270 8.1894 0.6606 6.5072 2.3250 2.0869
temp: 298.150 k
press: 1.00000 atm
elementType: 6 6 6 6 6 6 1 1 1 1 1 7 6 6 1 6 1 1 7
symmnumber: 1
zpe: 397343.1 jmol-1
zpe.correction: 0.151340 hartree
zpe.thermalcorrener: 0.159432 hartree
zpe.thermalcorrenthalpy: 0.160376 hartree
zpe.thermalcorrgfe: 0.117358 hartree
zpe.sumelectzpe: -457.151499 hartree
zpe.sumelectthermal: -457.143407 hartree
zpe.sumelectthermalent: -457.142463 hartree
zpe.sumelectthermalfe: -457.185481 hartree
dipole: -0.4283 -1.6709 -0.2884
dipole: 1.7488
quadrupole: -54.6447 -58.4540 -68.1516
quadrupole: -1.9017 -0.3452 -0.3634
quadrupole: 5.7721 1.9628 -7.7349 -1.9017 -0.3452 -0.3634
hfenergy: -457.3028391 hartree
pointgroup: C01 [X(C9H8N2)]
dipole: -0.1684937 -0.657371 -0.1134664 debye
dipolederiv: 0.1269235 -0.0414766 0.0003497 -0.0734412 0.1471212 -0.0209189 0.0125161 -0.0189813 -0.1180616 -0.2849556 0.0337331 0.0029774 0.2054359 -0.0474803 -0.0096767 0.0056124 0.0049237 -0.1171794 1.3890167 -0.0145055 -0.011274 -0.0506692 0.0580303 -0.0202632 -0.0077128 -0.0060033 0.0756932 -0.2563332 -0.011392 0.007675 -0.1800695 -0.0266149 -0.0205712 0.0089259 -0.0204167 -0.1426715 0.0774554 0.0191069 0.0019155 0.0981398 0.1235624 -0.021138 -0.013561 -0.0201536 -0.1181038 -0.0430282 0.0031299 0.0015198 -0.0339614 -0.120423 0.002036 0.0036743 -0.0021859 -0.1349459 0.0110827 0.0658838 -0.0056647 0.0848606 -0.0645202 0.0160189 -0.0103904 0.0147747 0.1222187 0.0987975 -0.048408 0.0063696 -0.049078 0.0372867 0.0132273 0.0192693 0.0050759 0.1326796 0.0353141 0.079595 -0.0096611 0.0782809 -0.0280807 0.0197417 -0.0172316 0.0197732 0.1299412 0.0041786 -0.0680467 0.0059878 -0.0881014 -0.0598565 0.0167136 0.0082331 0.0160909 0.1230636 -0.1165246 0.0041637 -0.001297 0.0035066 0.0670601 0.0062836 -0.0009678 0.0038963 0.1314599 -1.2096634 -0.0392893 -0.0051421 -0.0007655 0.0021279 0.0287579 0.0159637 0.0046126 0.0103256 0.6590221 -0.0416405 -0.0021262 -0.3570796 -0.026893 0.0183498 -0.0072968 0.0161373 -0.0902514 -0.4034772 -0.0931493 -0.0152563 -0.4314505 -0.0711662 0.0169888 -0.0796921 0.0215588 -0.2039976 0.0835358 -0.0630414 -0.0099198 -0.0424547 0.0075392 -0.0271877 -0.0051812 -0.0270316 0.1650605 -0.2572938 0.0240202 0.0024256 0.3406192 0.3672697 0.0648568 0.0693245 0.0655066 -0.0458655 -0.0174467 0.065537 0.0113157 0.0774327 0.0499251 -0.0174854 0.0048757 -0.0170311 0.1586632 -0.0064371 -0.0543186 -0.0080352 -0.0825844 0.007883 -0.0195906 -0.002741 -0.0185709 0.1337947 0.1098335 0.1800984 0.0278404 0.5013797 -0.4227707 -0.0461427 -0.0036202 -0.0419756 -0.2118233 unknown
polarizability: 169.4444677|-0.2385439|109.1223283|0.1233867|-0.2340029|47.1881758 unknown
InChI: InChI=1/9C.2N.8H
charge 0 multiplicity 1
19 atoms
C  -2.46679761 1.21661914 -0.10464332
C  -1.07962581 1.19130407 -0.10144446
C  -0.4151869 -0.03031329 0.00317398
C  -1.1412517 -1.21633155 0.10938349
C  -2.52939113 -1.17551575 0.09659192
C  -3.19970759 0.03764447 -0.01055982
H  -2.97881253 2.16969788 -0.18613926
H  -0.49189867 2.09697742 -0.17428723
H  -0.6311131 -2.16621692 0.21891892
H  -3.08775012 -2.10179142 0.18097921
H  -4.28375036 0.06412871 -0.01635807
N  0.99948528 -0.05261435 0.00120769
C  1.82477134 -1.1261656 -0.16312209
C  3.11195748 -0.65265504 -0.09748324
H  1.44026577 -2.11873505 -0.33114584
C  2.9662019 0.73137854 0.10818329
H  4.02065116 -1.22487169 -0.19179525
H  3.73577213 1.48165167 0.219475
N  1.69336612 1.09880643 0.16691984
