program: Gaussian 16
title: [Ir(H)2(DCM)(PhPy)(IMes)(PPh3)]
version: ES64L-G16RevC.01
method: RM06L
basis: GenECP
operation: Freq
keyword: #P
keyword: Geom=AllCheck
keyword: Guess=TCheck
keyword: SCRF=Check
keyword: GenChk
keyword: RM06L/GenECPFreq
converged: YES YES YES YES
title: Mulliken charges:
elementType: C C C C C C H C H H H C H H H C C H H C H H H H N N C C H C C H H H C C C H H H H C C H H H Ir H H C P C C C C C C C C C C H C H C H C H C H C H C H H C H H C H H H H H Cl C H H Cl C C C H C C H H H C C C C H C H C H H H N
charge: 0.042706 0.055684 0.038404 -0.178574 0.030788 -0.178349 0.098011 -0.250405 0.128765 0.108908 0.127292 -0.246542 0.120719 0.126045 0.126227 -0.017848 -0.039164 0.153170 0.151807 -0.247132 0.090362 0.137853 0.111952 0.101561 -0.340038 -0.347411 -0.176721 -0.181329 0.107154 0.053674 -0.276697 0.116007 0.128079 0.145389 0.048366 0.038533 -0.237384 0.140653 0.128742 0.117148 0.110686 0.007284 -0.244055 0.108405 0.111792 0.142806 0.366323 -0.079709 -0.030778 0.065442 0.496660 -0.212915 -0.232520 -0.229217 -0.117476 -0.119725 -0.121202 -0.072182 -0.072025 -0.069409 -0.100545 0.136263 -0.110451 0.150314 -0.091249 0.139239 -0.093393 0.156932 -0.108945 0.138273 -0.113182 0.159762 -0.103450 0.122647 0.132822 -0.111289 0.124421 0.116336 -0.101369 0.124322 0.119183 0.131269 0.127208 0.127042 -0.099122 -0.350433 0.229236 0.231439 -0.057063 0.095139 0.160731 -0.152581 0.113431 -0.171201 -0.033946 0.147968 0.141211 0.135652 0.042805 -0.155168 -0.114362 -0.078120 0.113323 -0.105911 0.119802 -0.110339 0.124174 0.122577 0.124447 -0.410437
chargesum: 1.00000
title: Mulliken charges with hydrogens summed into heavy atoms:
elementType: C C C C C C C C C C C N N C C C C C C C C C Ir C P C C C C C C C C C C C C C C C C C C Cl C Cl C C C C C C C C C C C N
charge: 0.042706 0.055684 0.038404 -0.077013 0.030788 -0.080338 0.114559 0.126450 0.135322 0.112643 0.093035 -0.340038 -0.347411 -0.069567 -0.070643 0.053674 0.112779 0.048366 0.038533 0.149158 0.007284 0.118948 0.255837 0.065442 0.496660 -0.212915 -0.232520 -0.229217 0.018787 0.030589 0.018037 0.084750 0.066249 0.090354 0.022102 0.022371 0.033171 0.022943 0.015377 0.006001 0.027819 0.015919 0.025673 -0.099122 0.110242 -0.057063 0.208570 0.160731 -0.004613 -0.029990 0.101706 0.042805 -0.041845 0.005439 0.046054 0.016666 0.014107 -0.410437
polarizability: 6.78667778e+02 4.97817905e+01 6.19428480e+02 4.77117554e+01 -3.43940654e-01 6.28791906e+02
1716.lowfreq: -7.3360 -3.7528 -0.0003 -0.0001 0.0014 1.3981 11.4216 18.1253 22.2914
redmass: 5.2801 4.1260 4.6988 4.9648 4.5545 5.7129 3.8194 4.6901 1.8618 3.2102 4.9632 4.3374 4.9055 3.7459 1.1957 6.4814 3.8536 4.5269 4.7064 7.3307 6.2630 4.2112 5.0392 5.2366 5.5801 4.1957 5.1043 4.6043 5.1124 2.9914 2.7348 2.2369 1.9869 2.0488 2.0738 1.7404 1.5318 2.5518 3.3643 2.8518 5.7281 2.8286 4.0755 3.0253 4.3142 2.7250 4.8100 3.8555 3.4636 2.9108 5.1936 4.8790 4.7384 4.1042 4.3173 4.8589 2.5172 2.5082 18.0028 3.2241 6.3505 2.9571 4.3249 4.2612 4.1368 4.7241 2.8978 2.8952 2.9342 3.0354 5.0457 5.1305 4.0835 6.3177 5.4435 3.9625 3.4090 3.5348 4.8929 3.8693 4.8672 3.1590 3.0679 5.2913 3.9976 2.8226 3.7921 1.2118 3.8568 3.5696 3.9021 4.1180 3.2893 6.5265 6.4249 6.3850 6.3396 6.6868 6.3573 4.7612 7.8300 5.0755 4.5405 3.6055 2.1111 1.9332 3.7410 2.2126 2.0772 3.3081 1.6639 4.3970 7.8909 2.4403 4.0245 1.8964 1.9258 1.8282 1.5368 4.6881 2.3476 1.2977 1.1199 1.1928 1.2257 1.2331 1.2587 1.2538 1.2513 1.1036 1.2956 1.3474 1.2934 1.3018 1.3218 1.3349 1.3208 1.4733 2.9820 2.8250 2.0842 2.1791 1.4746 1.4629 1.8682 1.3891 1.5254 1.4095 2.9148 1.2767 1.2616 1.2763 1.2832 1.2854 1.3210 5.9207 5.8802 5.7891 5.5852 5.6257 1.6990 1.5796 1.5959 1.7946 1.5526 4.9456 1.5757 1.5774 1.5760 2.5611 1.7257 2.6161 1.6906 2.6326 1.7748 1.9384 2.1858 1.8479 1.7785 2.6406 1.6609 1.5768 1.6498 1.8674 2.1553 2.8106 2.6924 2.7817 1.5466 1.0906 1.0801 1.0582 1.0823 1.0663 1.0573 1.5268 1.4472 1.1254 1.1349 1.1400 1.1369 2.3063 1.3532 1.3779 1.1114 6.3436 2.0209 2.7966 1.5865 3.9277 3.1445 1.6150 1.5307 8.4954 3.4559 1.4886 6.0998 3.6568 4.0615 6.0030 4.3768 4.5198 5.1986 1.2442 1.2526 1.2492 1.2751 1.4636 1.4712 1.0791 3.0729 1.8885 1.9261 2.0572 1.5369 1.9200 1.3303 2.1300 2.2091 1.0650 1.0717 1.0518 1.0613 1.0549 1.0646 2.1909 1.0981 1.0878 2.2590 1.5574 1.5829 2.0960 2.0578 2.0626 2.4569 2.5460 2.6429 5.1753 5.6073 5.3610 5.5465 5.5064 5.7169 5.5374 5.6382 5.6440 7.0488 5.7887 7.7218 5.8798 6.0187 6.0657 1.0124 1.0128 1.0417 1.0390 1.0408 1.0381 1.0382 1.0390 1.0959 1.0543 1.0972 1.0992 1.0995 1.0955 1.0995 1.1019 1.1015 1.1004 1.1016 1.1006 1.1018 1.0905 1.0874 1.0904 1.0905 1.0906 1.0864 1.0848 1.0845 1.0857 1.0863 1.0865 1.0872 1.0899 1.0868 1.0913 1.0910 1.0916 1.0938 1.0942 1.0931 1.0888 1.0967 1.0977 1.0989 1.0989 1.0946 1.0949 1.1166 1.0989 1.0900 1.1121
irintensity: 0.0530 0.0860 0.0646 0.1207 0.0670 0.5033 0.0673 0.3217 0.1452 0.0092 0.2418 0.5687 0.1072 0.2625 0.2134 0.4200 0.1211 0.1084 0.0720 1.1081 0.0855 0.0468 0.1916 0.1096 0.5450 0.3114 0.4521 1.0585 0.9435 0.3549 0.1236 0.4017 0.2247 0.3284 1.5753 0.5224 0.2209 1.9271 0.3221 2.4329 0.3422 1.4726 0.7067 5.2575 0.4642 5.6686 2.1940 0.6913 0.3097 0.0330 1.4306 0.0555 0.3772 0.0921 0.5895 0.2842 0.0774 0.1934 0.8555 0.6925 0.0756 0.3023 0.9030 2.4344 0.2675 0.1949 0.1582 0.3180 0.0965 1.0992 9.3430 3.6655 1.6288 8.7785 6.4662 2.0862 0.3782 8.6228 17.6949 4.4086 39.5847 0.1447 0.1024 108.6201 0.0690 3.8992 1.3460 3.9663 1.4127 6.6718 2.0384 1.1588 2.3766 0.4722 0.3671 0.4272 0.1183 4.9112 1.5207 0.5637 58.9470 0.1207 11.3982 15.4562 33.5263 28.0849 17.3321 65.4569 17.4017 9.0514 6.6216 1.1931 97.9190 44.1265 7.9799 6.7731 7.1018 11.7593 30.4268 3.8260 10.4525 0.1713 8.0126 6.5138 5.1116 4.1536 19.6259 11.9289 5.4774 17.2484 0.4109 6.5597 0.5280 0.4262 1.8683 0.6143 0.1065 1.4174 22.2858 6.3496 2.9516 1.6328 12.1175 0.6265 1.3262 1.1589 1.6856 1.7826 0.9329 16.0678 0.7874 0.0595 0.0620 0.5653 0.1320 3.0178 3.5764 1.1862 4.2141 1.8455 7.7046 0.3277 5.5486 7.0037 5.6081 1.6730 5.1706 6.9779 8.0207 0.8930 0.3916 0.4461 3.2864 0.2980 1.4894 0.1142 0.4812 1.3538 1.7945 5.3354 0.8002 2.4614 5.4897 8.0999 12.0836 26.1474 13.5340 1.8459 2.1629 4.1473 0.4422 1.3375 0.1405 0.3656 1.0211 2.0661 0.4186 0.9718 0.9773 0.5292 2.7829 32.3195 0.2145 0.3328 36.7469 32.7173 9.0102 0.3053 6.0633 12.9367 9.4007 1.9779 1.5143 46.0459 1.7553 0.6427 1.0223 0.7258 0.0861 1.7546 0.2918 1.1464 0.1361 1.0963 5.7618 4.3338 3.7141 16.5228 1.0278 2.4960 64.9594 1.0729 4.6242 9.5523 7.9331 11.2730 1.4900 15.6216 8.5022 13.1746 6.1628 16.4640 12.2662 3.6849 4.7940 11.0281 4.2222 0.9161 50.5653 15.1027 19.0824 5.4528 9.7320 7.0869 91.0602 3.0491 2.0338 6.8976 18.7128 0.5594 0.1949 0.2590 5.7135 0.2668 0.0672 0.1591 8.6871 22.4294 8.2187 2.1676 21.4454 15.1983 64.7664 19.9505 22.9048 17.7501 17.6363 22.9995 22.8445 12.4255 15.4490 0.8195 12.0269 7.6381 7.1513 9.9342 10.4899 8.8106 10.4604 11.7924 7.0793 2.3611 16.5250 10.8222 0.7113 14.1662 9.3343 8.6209 2.3190 1.4416 1.1424 0.0305 0.6884 0.5206 2.1527 2.8684 2.6915 2.0397 7.3849 6.1300 10.5208 4.4665 9.2407 0.2201 0.2066 28.0362 13.7875 14.5205 2.9999 3.6748 6.8433 1.7696 4.5286 1.5192
temp: 298.150 k
press: 1.00000 atm
elementType: 6 6 6 6 6 6 1 6 1 1 1 6 1 1 1 6 6 1 1 6 1 1 1 1 7 7 6 6 1 6 6 1 1 1 6 6 6 1 1 1 1 6 6 1 1 1 77 1 1 6 15 6 6 6 6 6 6 6 6 6 6 1 6 1 6 1 6 1 6 1 6 1 6 1 1 6 1 1 6 1 1 1 1 1 17 6 1 1 17 6 6 6 1 6 6 1 1 1 6 6 6 6 1 6 1 6 1 1 1 7
symmnumber: 1
zpe: 2345746.2 jmol-1
zpe.correction: 0.893448 hartree
zpe.thermalcorrener: 0.951377 hartree
zpe.thermalcorrenthalpy: 0.952322 hartree
zpe.thermalcorrgfe: 0.797241 hartree
zpe.sumelectzpe: -3504.469163 hartree
zpe.sumelectthermal: -3504.411233 hartree
zpe.sumelectthermalent: -3504.410288 hartree
zpe.sumelectthermalfe: -3504.565369 hartree
dipole: 1.2530 1.5557 -0.6910
dipole: 2.1137
quadrupole: -305.5305 -309.9542 -327.3797
quadrupole: 5.4800 4.1655 -0.2686
quadrupole: 8.7577 4.3339 -13.0916 5.4800 4.1655 -0.2686
hfenergy: -3505.3626101 hartree
pointgroup: C01 [X(C51H52Cl2Ir1N3P1)]
dipole: 0.4386216 0.5012788 -0.1878112 debye
polarizability: 678.6677785|49.7817905|619.4284798|47.7117554|-0.3439407|628.7919063 unknown
InChI: InChI=1/51C.2Cl.Ir.3N.P.52H
charge 1 multiplicity 1
110 atoms
C  -1.26224582 -3.94460607 0.91304987
C  -0.6465401 -3.70182869 -0.32072972
C  -1.35792802 -3.67334406 -1.51922149
C  -2.74006903 -3.85529688 -1.45515537
C  -3.40089841 -4.0676181 -0.24741875
C  -2.6402844 -4.12903932 0.92233594
H  -3.13915809 -4.30219677 1.87290386
C  -4.89021275 -4.20862863 -0.18964161
H  -5.33885003 -3.37370909 0.35800812
H  -5.33501913 -4.23030667 -1.18531388
H  -5.18676747 -5.12309117 0.33083528
C  -0.47264816 -3.92478565 2.18457568
H  -1.09427544 -4.1947999 3.03926584
H  0.37917557 -4.61113679 2.1574641
H  -0.06250587 -2.92415595 2.37001729
C  1.75214868 -4.34392112 -0.44295281
C  2.93194679 -3.69342607 -0.33215387
H  1.52273769 -5.38613746 -0.59056179
H  3.94983654 -4.04542244 -0.35686867
C  -0.6668427 -3.44272535 -2.82651402
H  0.08380815 -2.65074022 -2.75142574
H  -0.14516188 -4.3430512 -3.16928317
H  -1.3806104 -3.1632262 -3.60351272
H  -3.31521942 -3.82011596 -2.37734499
N  0.75849155 -3.39127051 -0.32871673
N  2.63178676 -2.35236414 -0.16065159
C  5.22023309 0.27555231 -0.56882546
C  4.96793675 -0.22795622 1.75821313
H  5.69388517 0.84498117 -1.36554854
C  4.25139285 -0.67050605 -0.90899959
C  3.9037946 -0.89316713 -2.34823899
H  3.1561526 -1.67560281 -2.48469022
H  3.51884751 0.02350722 -2.80625347
H  4.79073917 -1.17858365 -2.92072827
C  3.63617184 -1.36889753 0.13203427
C  4.00353135 -1.19033201 1.47534605
C  3.43099817 -2.04009206 2.56857526
H  3.99520428 -2.97433704 2.6662508
H  3.48172514 -1.52853871 3.53123828
H  2.3908805 -2.31722968 2.38540007
H  5.25528025 -0.06652485 2.79415581
C  5.57874928 0.52467619 0.75246465
C  6.60434828 1.56056788 1.09575342
H  6.79289797 2.23645324 0.2597634
H  6.29471944 2.16001905 1.95647636
H  7.55984081 1.09920237 1.36351736
Ir 0.07959461 -0.4429155 0.03726515
H  -0.52182067 -0.88060439 -1.32115289
H  -0.92310664 -1.45618428 0.67927205
C  1.28140421 -2.13250761 -0.15238805
P  -1.74056299 1.02044395 0.26069146
C  -1.40540608 2.5857104 1.15370116
C  -2.57196858 1.52603755 -1.28786162
C  -3.1331214 0.28115216 1.20905393
C  -0.54396169 3.52553627 0.56982288
C  -1.88122577 2.82129918 2.44731442
C  -3.02207251 2.82661935 -1.52526184
C  -2.8798553 0.51768442 -2.2092293
C  -4.46263213 0.59165745 0.90574406
C  -2.86982316 -0.57505186 2.2837847
C  -0.16675285 4.66893089 1.2636794
H  -0.17761184 3.36779439 -0.44134838
C  -1.49826804 3.96651507 3.14132341
H  -2.55671422 2.11102065 2.91435755
C  -3.76566855 3.11380594 -2.6668024
H  -2.81297569 3.61644526 -0.81068294
C  -3.63813262 0.80522139 -3.33496329
H  -2.5413882 -0.50009011 -2.02984181
C  -5.50182439 0.04769681 1.65334187
H  -4.69388997 1.25449621 0.07795207
C  -3.90963499 -1.11081028 3.03380976
H  -1.84454032 -0.82708698 2.53372235
C  -0.63775103 4.88889302 2.55624184
H  0.49433758 5.38981059 0.79302183
H  -1.88175631 4.14002973 4.14164346
C  -4.08211547 2.10418506 -3.56730772
H  -4.11298015 4.12712009 -2.83988279
H  -3.87694092 0.01379761 -4.03828042
C  -5.22908793 -0.80417335 2.71772475
H  -6.52812336 0.29245793 1.40084039
H  -3.68676729 -1.77317744 3.86449729
H  -0.34308238 5.78053035 3.09906735
H  -4.67386827 2.327467 -4.44903417
H  -6.04173643 -1.22718988 3.29893415
Cl 0.80856943 0.10231966 2.73580513
C  1.23476207 1.78636173 3.22250496
H  0.9840644 2.43766649 2.3869329
H  0.64602298 2.01106494 4.10768212
Cl 2.945314 1.9683767 3.60803189
C  2.37224733 1.70501579 0.07280939
C  1.37079321 1.94723725 -1.99335672
C  3.03528262 2.91633958 -0.02142694
H  2.53635609 1.06560388 0.93441202
C  2.03365653 3.17090305 -2.16496567
C  2.8557115 3.67358384 -1.17092378
H  3.68840444 3.23224561 0.78437565
H  1.90988875 3.70325997 -3.10082809
H  3.36544336 4.62202285 -1.3041683
C  0.53157313 1.44290933 -3.09582694
C  -0.24050836 2.33702502 -3.84883059
C  0.58115596 0.1020715 -3.48909847
C  -0.930601 1.90524545 -4.97184041
H  -0.31450439 3.37556507 -3.53819196
C  -0.09895111 -0.32556357 -4.62255208
H  1.186774 -0.5912274 -2.91605508
C  -0.85118794 0.5744666 -5.36945423
H  -1.53382722 2.60837603 -5.53603863
H  -0.0228258 -1.36101897 -4.93726041
H  -1.37491548 0.24007293 -6.25892107
N  1.53024743 1.22133837 -0.85840256
