program: Gaussian 16
title: [Ir(H)2(PhPy)(IMes)(PPh3)]
version: ES64L-G16RevC.01
method: RM06L
basis: GenECP
operation: Freq
keyword: #P
keyword: Geom=AllCheck
keyword: Guess=TCheck
keyword: SCRF=Check
keyword: GenChk
keyword: RM06L/GenECP
keyword: Freq
converged: YES YES NO YES
title: Mulliken charges:
elementType: C C C C C C H C H H H C H H H C C H H C H H H H N N C C H C C H H H C C C H H H H C C H H H Ir H H C P C C C C C C C C C C H C H C H C H C H C H C H H C H H C H H H H H C C C C H C H H H C C C C H C H C H H H N
charge: 0.042646 0.025048 0.022670 -0.177500 0.037824 -0.180780 0.104228 -0.250117 0.126029 0.131984 0.110595 -0.257723 0.143962 0.112007 0.117813 -0.028379 -0.029190 0.152644 0.153051 -0.246249 0.126048 0.128077 0.130494 0.104693 -0.347726 -0.350442 -0.171948 -0.166028 0.109141 0.034766 -0.256189 0.123977 0.137898 0.120979 0.050465 0.027987 -0.254345 0.124039 0.096030 0.139299 0.103388 0.009265 -0.257335 0.119632 0.141570 0.109009 0.349342 -0.042279 -0.121297 0.075837 0.558381 -0.231671 -0.216934 -0.218174 -0.131636 -0.116385 -0.098575 -0.104758 -0.085651 -0.104513 -0.095895 0.144105 -0.104802 0.141540 -0.089855 0.132962 -0.092334 0.160501 -0.095979 0.130782 -0.111569 0.173912 -0.103148 0.121446 0.122805 -0.109294 0.122624 0.127264 -0.093800 0.124174 0.117896 0.124265 0.120979 0.125779 0.265573 0.066814 -0.183628 -0.160174 0.177065 -0.021207 0.132596 0.133923 0.136911 0.065537 -0.146861 -0.139335 -0.088534 0.117612 -0.080446 0.080724 -0.117350 0.129299 0.129216 0.129052 -0.476137
chargesum: 1.00000
title: Mulliken charges with hydrogens summed into heavy atoms:
elementType: C C C C C C C C C C C N N C C C C C C C C C Ir C P C C C C C C C C C C C C C C C C C C C C C C C C C C C C C N
charge: 0.042646 0.025048 0.022670 -0.072806 0.037824 -0.076551 0.118490 0.116059 0.124265 0.123861 0.138370 -0.347726 -0.350442 -0.062807 -0.062640 0.034766 0.126665 0.050465 0.027987 0.105023 0.009265 0.112876 0.185766 0.075837 0.558381 -0.231671 -0.216934 -0.218174 0.012469 0.025155 0.034386 0.055744 0.045131 0.069399 0.025551 0.018003 0.032769 0.034930 0.028195 0.006327 0.021117 0.011685 0.031979 0.265573 0.243879 -0.051032 -0.026251 0.115705 0.065537 -0.029249 -0.058611 0.040765 0.048769 0.011702 -0.476137
polarizability: 6.66225169e+02 -1.39847256e+01 5.51093407e+02 -3.70712402e+01 9.24422676e+00 6.03049649e+02
1716.lowfreq: -5.0560 -3.7340 -0.0009 -0.0005 -0.0003 1.3971 6.1978 15.4436 21.2602
redmass: 5.0053 5.0048 3.9015 3.9069 3.4785 2.9726 1.7258 4.2583 3.1149 3.6153 4.0004 4.3568 4.6513 4.3871 3.6796 2.9925 4.0619 1.4581 2.0781 4.4291 2.2395 2.7151 4.0026 3.6771 3.7859 1.5653 1.2603 4.0802 3.4288 2.8410 5.2486 4.7817 4.4723 6.3669 3.2583 2.1416 1.8324 3.0282 4.1327 3.0513 4.9138 3.0462 4.6621 2.9325 4.6546 5.4967 4.5160 4.3999 3.0646 3.0839 2.6753 4.6707 3.2436 3.0124 6.6672 3.9914 4.9174 4.8550 3.3347 3.1192 2.9403 2.9886 4.8729 4.8457 4.6934 3.6766 4.3982 5.5844 3.6198 4.2624 3.4333 3.3572 5.7448 3.1330 4.3545 3.1910 6.1825 3.0267 3.4293 3.0081 1.4215 3.4735 4.0898 3.4471 4.0602 3.2378 6.2829 6.3942 6.3911 6.3912 6.7112 5.5186 5.2692 5.1267 3.7171 4.1466 2.0885 2.4492 3.2873 2.2872 2.8048 2.5526 1.9409 4.3659 2.1635 1.8196 3.9787 1.7664 1.5216 1.5938 5.3184 2.3091 1.2925 1.0942 1.2359 1.2432 1.2581 1.2607 1.2431 1.0773 1.2401 1.1256 1.2988 1.2992 1.2907 1.3081 1.3114 1.3111 3.5381 1.3767 2.5034 2.1724 2.2501 1.3935 1.4238 3.3872 1.4026 1.3665 1.3535 4.0419 1.2814 1.2868 1.2952 1.2766 1.2685 3.1634 6.1857 6.1745 6.1932 7.0514 1.6784 1.7074 1.6125 1.6056 1.6120 3.5348 1.8694 1.5552 1.6319 2.7722 2.1435 1.8727 2.6110 1.5345 1.9589 1.9653 2.0429 1.8438 1.8216 1.7222 2.4321 1.6034 1.5912 2.7018 2.7620 2.7873 2.8307 1.6254 1.4638 1.0882 1.0822 1.0827 1.0841 1.3759 1.1838 1.4463 1.1327 1.1358 1.1360 1.1226 2.3197 1.3628 1.3589 6.2954 1.6039 2.4967 2.1188 2.1205 2.4174 1.9075 1.4885 2.0150 3.5959 8.9061 6.1593 5.3998 4.2003 4.7352 4.7844 4.4550 5.1778 1.2522 1.2516 1.2646 1.2913 1.4741 1.4545 2.8800 1.8904 1.9463 2.0814 1.3958 2.1469 1.3182 2.2092 1.6954 1.2321 1.0481 1.0860 1.0753 1.6746 1.1980 1.1128 1.0992 1.0948 2.2543 1.5683 1.5626 2.0948 2.1023 2.0868 2.5092 2.4905 2.6662 5.2011 5.4726 5.3892 5.5837 5.6609 5.7026 5.7141 5.6189 5.6683 7.4980 7.6635 5.8188 6.0819 6.0152 6.0056 1.0129 1.0131 1.0896 1.0448 1.0392 1.0394 1.0398 1.0381 1.0394 1.0932 1.0986 1.0970 1.0981 1.0966 1.0992 1.1022 1.1019 1.1017 1.1005 1.1019 1.1007 1.0877 1.0905 1.0906 1.0904 1.0906 1.0860 1.0859 1.0858 1.0857 1.0870 1.0852 1.0894 1.0898 1.0906 1.0873 1.0945 1.0891 1.0942 1.0905 1.0945 1.0938 1.0989 1.0992 1.0990 1.0988 1.0944 1.0962 1.0900 1.1122
irintensity: 0.1152 0.0623 0.1628 0.2106 0.3244 0.2475 0.3187 0.1025 0.1022 0.1358 0.4312 0.1865 0.0624 0.1612 0.3604 0.2079 0.1964 0.3065 0.2958 0.3676 0.5557 0.6969 0.3785 0.7776 0.4489 0.1308 0.2687 0.5170 0.3505 0.7127 0.1670 0.0566 0.1129 0.3486 0.8391 1.3919 0.2107 3.4698 1.2633 4.1824 3.0992 0.0343 0.8599 0.0370 1.8808 0.1285 0.1478 0.3974 0.0147 0.0134 0.4883 0.1859 0.6325 0.4581 0.5846 0.1662 1.6628 0.0845 0.6692 0.2614 0.2119 0.0047 7.8373 5.1663 3.8325 1.9341 4.1810 7.9756 3.3351 2.9820 3.8048 0.9117 29.1446 2.9901 49.8591 2.4637 113.1939 1.8853 0.6297 1.9297 5.4119 0.6311 3.8058 5.6240 2.3705 1.4256 0.4036 0.0145 0.0161 0.7843 2.7194 1.0602 0.1488 0.1255 19.8249 10.5926 12.0166 75.9364 33.7979 5.3196 23.7832 7.4606 2.4634 0.3707 41.4593 8.4574 5.6835 19.5075 25.6560 18.8102 2.8621 3.4737 0.1337 10.1109 1.5941 4.4930 24.6615 5.3054 1.9068 37.7780 6.2034 33.3706 0.1481 3.4902 7.6381 0.3144 0.5043 0.2757 19.7437 15.2217 3.8063 4.4467 1.7212 2.6424 1.1434 3.7280 0.0792 0.1930 0.2685 2.1316 0.1629 0.2901 0.3238 0.1057 0.0940 1.1655 5.4051 2.6792 1.8733 1.8841 9.1913 5.6403 0.4824 0.6006 2.5404 4.0063 9.9996 10.3013 3.4408 0.2852 2.3560 2.6408 2.5772 2.1439 0.0807 0.0544 1.2091 2.0634 2.0820 4.2154 4.7710 1.7079 2.4067 21.6263 27.9013 22.6697 1.5144 3.8720 4.3143 2.9925 0.1795 0.5687 0.5378 1.6193 1.7242 0.2174 2.1846 4.2373 0.3454 6.5374 36.8956 0.1404 0.2374 25.7551 3.1661 1.2438 6.0391 0.8766 6.4016 1.9669 1.5354 0.4330 10.9916 61.7007 0.6737 3.5761 0.9430 0.5209 0.3582 2.0761 1.7808 1.1464 6.9205 3.0172 5.2564 12.7403 4.0431 83.1734 0.2987 2.8946 9.1279 2.0926 6.6922 1.9728 28.5440 10.3952 4.8238 14.0570 6.6283 0.2187 18.4192 11.4215 3.9881 6.3550 5.1091 34.9286 11.2397 28.1356 4.6560 3.2572 10.2902 102.7896 2.4091 2.4897 6.1992 7.2983 0.0673 0.1215 0.8108 2.8842 0.1534 0.1304 1.5316 1.8780 7.4425 21.7398 2.4306 35.5215 3.2747 127.4835 22.5278 17.8034 14.4707 22.9572 15.4125 22.7900 26.4795 8.8691 13.1347 7.3552 12.8869 3.1124 15.6098 12.1585 8.5025 13.1671 6.7229 7.0582 8.8081 10.0339 2.4298 12.5371 7.7032 13.4609 9.2516 1.0972 1.0177 1.5899 1.0174 0.5781 0.8968 0.6072 1.1796 1.2578 1.7984 13.0959 1.2329 11.2877 3.3192 13.6966 5.3274 14.2442 18.6934 19.0710 4.9126 3.2194 2.7755 4.8737 1.6806
temp: 298.150 k
press: 1.00000 atm
elementType: 6 6 6 6 6 6 1 6 1 1 1 6 1 1 1 6 6 1 1 6 1 1 1 1 7 7 6 6 1 6 6 1 1 1 6 6 6 1 1 1 1 6 6 1 1 1 77 1 1 6 15 6 6 6 6 6 6 6 6 6 6 1 6 1 6 1 6 1 6 1 6 1 6 1 1 6 1 1 6 1 1 1 1 1 6 6 6 6 1 6 1 1 1 6 6 6 6 1 6 1 6 1 1 1 7
symmnumber: 1
zpe: 2262230.3 jmol-1
zpe.correction: 0.861638 hartree
zpe.thermalcorrener: 0.914660 hartree
zpe.thermalcorrenthalpy: 0.915604 hartree
zpe.thermalcorrgfe: 0.769454 hartree
zpe.sumelectzpe: -2544.781790 hartree
zpe.sumelectthermal: -2544.728768 hartree
zpe.sumelectthermalent: -2544.727824 hartree
zpe.sumelectthermalfe: -2544.873974 hartree
dipole: 0.8382 -2.1864 -3.4403
dipole: 4.1616
quadrupole: -273.3652 -289.5418 -284.4964
quadrupole: 1.6935 -12.0464 0.4845
quadrupole: 9.1026 -7.0740 -2.0286 1.6935 -12.0464 0.4845
hfenergy: -2545.6434277 hartree
pointgroup: C01[X(C50H50Ir1N3P1)]
dipole: 0.2633441 -0.9032977 -1.1448995 debye
polarizability: 666.225169|-13.9847256|551.0934069|-37.0712402|9.2442268|603.0496492 unknown
InChI: InChI=1/50C.Ir.3N.P.50H
charge 1 multiplicity 1
105 atoms
C  1.15015403 -3.72207442 -1.76198997
C  1.04428707 -3.55813319 -0.38032209
C  2.16403775 -3.53487594 0.46328191
C  3.41833181 -3.65626756 -0.12310565
C  3.57636753 -3.77926531 -1.50623087
C  2.43496735 -3.8146754 -2.30293456
H  2.54080586 -3.92279977 -3.38003248
C  4.94547852 -3.84663789 -2.10775397
H  5.48827253 -2.90952432 -1.94809189
H  5.54485565 -4.63877275 -1.65163834
H  4.90839987 -4.03080708 -3.18219497
C  -0.06093463 -3.8341041 -2.6349807
H  -0.38187008 -4.87789398 -2.72293586
H  -0.91109909 -3.27416045 -2.24000585
H  0.14589839 -3.47796308 -3.64616495
C  -1.00195109 -4.49709582 0.65701054
C  -2.10595844 -3.98662386 1.24499196
H  -0.6725684 -5.51187306 0.50774346
H  -2.95119433 -4.46273979 1.71348073
C  2.00605795 -3.30805238 1.93552281
H  2.96202968 -3.39422681 2.45307454
H  1.59966362 -2.3079351 2.13870306
H  1.30874636 -4.0172624 2.39175862
H  4.29983922 -3.62524548 0.51297953
N  -0.25243051 -3.41761828 0.2191919
N  -2.00591067 -2.60947799 1.15959308
C  -3.85292788 -0.46266418 3.54265826
C  -5.02270594 -0.48087142 1.45060554
H  -3.77054737 -0.12794987 4.57393185
C  -2.87074429 -1.31233585 3.03383435
C  -1.72538074 -1.77721237 3.87811831
H  -1.75016105 -2.86180712 4.02756595
H  -0.76461877 -1.54564043 3.4084899
H  -1.74552106 -1.30789715 4.86196638
C  -3.00056263 -1.72570768 1.70546611
C  -4.07139329 -1.33360879 0.89659513
C  -4.20427809 -1.83575971 -0.50781657
H  -4.84922448 -1.18596442 -1.10130681
H  -3.2339861 -1.91349428 -1.00559044
H  -4.64568623 -2.83816392 -0.53110217
H  -5.85929103 -0.15893749 0.83541139
C  -4.93477546 -0.03879615 2.7711404
C  -5.99701106 0.84611084 3.34775077
H  -6.27720955 1.64328853 2.65436756
H  -6.90826248 0.27766097 3.55829852
H  -5.67945897 1.30424831 4.28623598
Ir -0.26256608 -0.259067 0.19664117
H  -1.78052299 0.06367845 0.27308673
H  -0.36647646 -0.11376017 1.77727642
C  -0.85824578 -2.22691158 0.51797187
P  0.07791427 2.06475462 0.17001739
C  0.43352062 2.72887642 -1.4934423
C  -1.38300461 3.01733738 0.73210299
C  1.40452543 2.71635832 1.24833414
C  -0.61119211 2.77771726 -2.42646915
C  1.73066684 3.02551529 -1.91653812
C  -1.6249512 4.31766695 0.27580388
C  -2.21546335 2.47460804 1.71579782
C  1.84552795 4.03973372 1.13374857
C  1.93751497 1.90794151 2.25414114
C  -0.36396371 3.13111105 -3.74554736
H  -1.62517714 2.54195461 -2.11107635
C  1.97549708 3.3822616 -3.23951887
H  2.55693572 2.97146474 -1.21383848
C  -2.68551586 5.05537732 0.78758674
H  -0.98918434 4.75497261 -0.48852163
C  -3.26724505 3.22172341 2.23308243
H  -2.0400773 1.46596859 2.07917445
C  2.82039258 4.53138551 1.99123996
H  1.42726372 4.68848563 0.3691945
C  2.91004953 2.40401067 3.11593453
H  1.57881775 0.88779126 2.3608183
C  0.93209856 3.43625509 -4.15553601
H  -1.18387548 3.1723423 -4.4553131
H  2.9879718 3.61985418 -3.550993
C  -3.50660538 4.51038709 1.76937469
H  -2.86750273 6.06007453 0.42107435
H  -3.8981865 2.79192652 3.00407075
C  3.35717316 3.71282092 2.98136131
H  3.15806825 5.55736597 1.89118586
H  3.31566563 1.76786854 3.89605684
H  1.12417346 3.72040849 -5.18480996
H  -4.32964843 5.09112245 2.17231194
H  4.11635949 4.10033121 3.65237906
C  1.15772418 -0.42430187 -2.67050321
C  -1.15830044 -0.55508094 -2.78244976
C  1.22689117 -0.54899503 -4.06389348
C  -1.15513865 -0.63968455 -4.16208535
H  -2.088452 -0.55096625 -2.22359618
C  0.07131046 -0.65092283 -4.81639731
H  2.19515012 -0.57373504 -4.54827716
H  -2.09157103 -0.70551638 -4.70249111
H  0.12582088 -0.74012545 -5.89592801
C  2.36921925 -0.21637295 -1.86037767
C  3.52960839 0.31464511 -2.44407378
C  2.3993958 -0.47715882 -0.48381998
C  4.65832555 0.58328663 -1.68548704
H  3.53244203 0.57014455 -3.49786851
C  3.53121198 -0.21260941 0.27894734
H  1.6163797 -1.08967155 -0.00738251
C  4.66248129 0.32824019 -0.31608486
H  5.53547215 1.00768438 -2.16213867
H  3.5299733 -0.44844549 1.33790858
H  5.54289493 0.5433979 0.27961936
N  -0.04271847 -0.4589594 -2.03885477
