program: Gaussian 16
title: TS_PhPm_10
version: ES64L-G16RevC.01
method: RM06L
basis: GenECP
operation: Freq
keyword: #P
keyword: Geom=AllCheck
keyword: Guess=TCheck
keyword: SCRF=Check
keyword: GenChk
keyword: RM06L/GenECP
keyword: Freq
converged: YES YES NO YES
title: Mulliken charges:
elementType: Ir H P C C H H N N C H C C C C C C H H H H H C C C C C C C H H C C C C C C H H C H H H C H H H C H H H C H H H C H H H C H H H C C C C H C H C H H H C C C H C H C H H H C C C C H C H C H H H C N C H C H C H N
charge: 0.372219 -0.167119 0.644269 -0.031711 -0.024877 0.154931 0.154610 -0.351927 -0.345811 0.130659 -0.067004 0.026803 -0.286106 -0.123652 -0.099542 -0.097091 -0.112928 0.135515 0.135640 0.125178 0.126587 0.139059 0.383556 0.031511 0.015479 0.052965 -0.170207 -0.166795 0.019500 0.105196 0.105580 0.047915 0.049342 0.019082 -0.179312 -0.188511 0.019014 0.104896 0.107450 -0.235664 0.103492 0.119393 0.136987 -0.247615 0.108994 0.121970 0.138735 -0.262981 0.136080 0.117046 0.128001 -0.236329 0.106413 0.133470 0.125318 -0.252777 0.130445 0.120103 0.136485 -0.244069 0.142035 0.111612 0.109419 -0.211985 -0.142084 -0.133100 -0.087135 0.146164 -0.086807 0.147334 -0.108106 0.124376 0.127672 0.127190 -0.077651 -0.081655 -0.100447 0.132299 -0.102059 0.176741 -0.092472 0.125841 0.114144 0.127691 -0.216058 -0.104143 -0.118483 -0.086071 0.139963 -0.106843 0.164628 -0.094677 0.126296 0.120652 0.127369 -0.260785 -0.477407 0.091942 0.135641 0.095683 0.185648 -0.193166 0.139398 -0.336464
chargesum: 1.00000
title: Mulliken charges with hydrogens summed into heavy atoms:
elementType: Ir P C C N N C C C C C C C C C C C C C C C C C C C C C C C C C C C C C C C C C C C C C C C C C C C C N C C C N
charge: 0.273611 0.644269 0.123220 0.129733 -0.351927 -0.345811 0.130659 0.026803 -0.286106 0.011988 0.025636 0.029497 0.026131 0.383556 0.031511 0.015479 0.052965 -0.065011 -0.061214 0.019500 0.047915 0.049342 0.019082 -0.074417 -0.081061 0.019014 0.124207 0.122084 0.118146 0.128871 0.134256 0.118997 -0.211985 0.004080 0.014234 0.037241 0.040864 0.019084 0.054648 0.095085 0.025394 0.012086 0.035219 -0.216058 0.035820 0.046146 0.040225 0.013810 0.032692 -0.260785 -0.477407 0.227583 0.281331 -0.053768 -0.336464
polarizability: 6.27016668e+02 -9.00294298e-01 5.23074358e+02 6.76598350e+01 -1.67151378e+00 6.63655211e+02
1716.lowfreq: -669.0633 -1.3670 -0.0010 0.0007 0.0009 2.2126 3.8975 8.6585 14.0673
redmass: 1.0878 5.0040 5.3043 4.4252 4.0791 5.1739 5.3684 3.9148 1.7309 2.3485 2.9074 4.6133 5.3518 2.1535 1.9415 2.5354 4.3030 2.9901 3.7858 2.9173 2.6351 1.7174 3.9496 3.3555 2.2138 4.1194 1.9502 3.2966 1.1448 2.5639 3.2078 4.1725 1.6497 5.5608 4.6266 5.1243 3.0875 3.0202 5.4155 5.7378 4.8676 5.1115 3.0787 2.9722 4.6223 5.3994 5.5566 3.7373 6.2051 5.1127 2.5161 2.5128 4.7022 3.3310 2.9425 4.0128 5.1002 5.5463 4.9680 2.8734 2.8986 3.0069 4.8160 4.1617 4.7330 4.0084 5.5493 5.3150 4.1605 4.0753 4.3726 3.3551 3.4065 6.0473 3.1421 4.3361 3.2940 5.9573 4.1036 3.0992 4.5638 3.9820 4.0378 3.3946 4.5302 2.9670 6.3269 6.3629 6.2665 5.0795 2.8701 5.2788 4.0494 5.6866 2.0652 4.2708 3.0345 1.9139 1.9899 2.8361 4.6641 2.8890 2.8691 1.5934 4.3549 1.7566 3.0067 1.9234 1.4985 1.8931 1.2718 5.1689 1.3619 1.5230 1.2928 1.9123 1.2502 1.2480 1.2576 1.2599 1.2417 1.2276 1.2746 1.1725 1.2966 1.1006 1.2967 1.3055 1.3041 4.1450 2.1292 2.2827 2.5267 1.3700 1.3887 3.5665 1.3683 2.3419 1.7877 1.4170 1.3417 1.3000 1.2805 1.2854 1.2739 5.8830 6.2453 6.2692 6.6734 1.7166 1.8507 6.9474 1.5214 1.5857 1.5685 1.5627 1.5544 1.5623 1.5589 1.5468 2.7872 2.8009 2.7690 4.9016 1.9772 1.9780 2.0751 1.8681 1.6087 2.6050 1.7031 1.5864 1.7513 2.6849 1.8151 2.6566 2.8607 2.4576 1.5173 1.0991 1.0821 1.0829 1.0820 1.5276 1.4465 1.1349 1.1366 1.1363 2.2342 1.6040 1.3714 1.3566 4.3127 6.5340 1.8004 1.6150 1.5175 3.7551 1.4999 3.3006 3.8901 9.1633 6.3397 6.5903 3.0699 3.5668 4.5189 4.8425 4.3655 1.2581 1.2491 1.2529 1.2835 1.4640 1.4746 2.6913 2.0794 1.8266 1.9073 1.4828 2.2985 2.2543 1.3836 2.1135 1.0698 2.2869 2.1619 1.0549 1.0848 1.0772 1.0502 1.0802 1.0658 1.0758 3.6475 1.6300 1.5596 2.0890 2.0780 2.0920 2.4310 2.4137 5.1286 5.7068 5.2042 5.3886 5.7982 5.5816 5.6295 6.1003 5.5825 5.7282 7.4428 5.7063 7.6643 5.9939 6.0150 1.0151 1.0136 1.0113 1.0392 1.0393 1.0389 1.0391 1.0384 1.0384 1.0991 1.0988 1.0978 1.0982 1.0985 1.0992 1.1025 1.1005 1.1016 1.1016 1.0910 1.1013 1.1010 1.0904 1.0904 1.0906 1.0876 1.0905 1.0855 1.0861 1.0852 1.0872 1.0864 1.0860 1.0903 1.0905 1.0905 1.0917 1.0914 1.0919 1.0948 1.0945 1.0978 1.0991 1.0966 1.0992 1.0937 1.0969 1.0902 1.1124
irintensity: 139.3105 0.0194 0.0339 0.0272 0.0033 0.0328 0.3694 0.1277 0.0516 0.0747 0.3306 0.4506 0.6628 0.3997 0.0955 0.4624 0.0845 0.2478 0.2148 0.1912 0.8287 0.1774 0.4567 0.7086 0.6638 1.1474 0.2473 1.9438 0.7546 1.3665 0.0522 1.5993 0.3908 0.1173 0.8307 0.6211 3.7071 7.8438 0.8272 0.7066 3.1462 0.3817 0.0730 0.0258 0.9388 0.6990 0.5966 0.0508 1.1227 0.1185 0.0424 0.2760 0.3775 0.9774 0.5142 0.0337 0.5826 2.4097 0.0765 0.0387 0.4996 0.0481 4.9574 1.8159 3.3600 4.2998 4.8204 8.6606 0.3361 2.5868 0.5798 0.0783 0.4628 36.4914 2.9323 40.7728 5.4446 122.9832 0.0921 0.4498 1.9417 0.2356 4.5198 5.4018 1.0450 4.3949 0.3285 0.2199 0.9752 3.0168 5.5807 1.0553 6.2399 3.8634 3.8374 22.4703 11.6860 25.6259 64.1997 20.7401 17.8008 21.5951 5.0699 7.9442 0.4981 5.5190 3.9895 5.3735 52.3137 10.2386 48.4930 1.9994 1.2543 20.7251 0.0145 5.1552 2.6934 1.7393 18.6476 13.3979 3.5780 25.9526 7.4569 51.3695 0.7457 68.3587 3.2495 2.1549 0.3667 16.2170 1.3276 2.6381 0.6844 7.3515 0.3776 2.4780 0.2448 0.7066 0.1304 0.5871 2.2747 0.9261 0.0879 0.0247 0.0326 2.5153 2.9656 1.9023 13.4156 12.6202 2.5174 1.0827 0.6272 0.5685 1.7944 18.5115 11.0299 6.0717 2.7216 5.1984 0.3139 0.1053 0.5609 1.3833 0.2084 0.4449 7.8117 2.0563 0.9156 3.0951 1.3159 1.7604 7.7124 28.4233 8.5730 29.1265 8.3667 4.7843 1.9364 1.0139 0.5012 0.1708 0.3042 1.8118 0.0357 1.3045 3.6444 0.2648 34.7612 2.8767 0.7093 0.2860 5.5295 18.5760 6.2687 1.3757 7.5164 0.3529 1.2124 3.6504 4.4547 38.1282 2.7335 5.1308 2.2806 0.1209 0.3081 0.4013 0.9111 0.3119 3.1638 8.0064 3.2415 13.4275 6.2017 42.6391 75.2055 0.2124 3.6589 3.5829 22.7032 53.4685 8.8075 27.4840 3.9959 18.8830 4.7777 15.2475 0.7173 20.4417 4.5982 3.9109 11.6323 2.4427 62.5348 4.4739 39.1448 4.5177 6.8499 8.5847 102.8267 5.4964 38.0709 19.3802 4.3432 1.4299 112.7795 4.3763 1.5885 14.3256 0.1095 1.2168 1.0467 0.3018 8.5557 36.1073 9.3793 89.0794 81.5610 59.9251 19.6290 13.9972 4.6345 33.4114 20.6118 23.0339 19.4364 9.0662 3.3469 10.2733 8.2214 7.2631 8.2896 7.7537 11.7125 7.1792 13.8277 8.0250 8.9183 13.8273 12.6526 8.4430 2.3135 5.7483 1.5526 0.6697 0.5927 0.2518 1.6676 0.2385 4.7149 0.8479 2.2501 0.7041 4.5012 10.1351 9.7770 10.5076 11.7233 12.4723 12.0361 15.5637 9.1856 1.2847 4.6677 2.1847
temp: 298.150 k
press: 1.00000 atm
elementType: 77 1 15 6 6 1 1 7 7 6 1 6 6 6 6 6 6 1 1 1 1 1 6 6 6 6 6 6 6 1 1 6 6 6 6 6 6 1 1 6 1 1 1 6 1 1 1 6 1 1 1 6 1 1 1 6 1 1 1 6 1 1 1 6 6 6 6 1 6 1 6 1 1 1 6 6 6 1 6 1 6 1 1 1 6 6 6 6 1 6 1 6 1 1 1 6 7 6 1 6 1 6 1 7
symmnumber: 1
zpe: 2220461.0 jmol-1
zpe.correction: 0.845729 hartree
zpe.thermalcorrener: 0.897982 hartree
zpe.thermalcorrenthalpy: 0.898926 hartree
zpe.thermalcorrgfe: 0.755022 hartree
zpe.sumelectzpe: -2560.806319 hartree
zpe.sumelectthermal: -2560.754066 hartree
zpe.sumelectthermalent: -2560.753122 hartree
zpe.sumelectthermalfe: -2560.897025 hartree
dipole: 2.0571 -1.1753 0.5752
dipole: 2.4380
quadrupole: -280.8091 -284.9462 -283.9569
quadrupole: -2.7005 19.8072 1.1534
quadrupole: 2.4283 -1.7088 -0.7195 -2.7005 19.8072 1.1534
hfenergy: -2561.6520476 hartree
pointgroup: C01 [X(C49H49Ir1N4P1)]
dipole: 0.6965411 -0.5690956 0.2689967 debye
polarizability: 627.0166682|-0.9002943|523.0743576|67.659835|-1.6715138|663.6552106 unknown
InChI: InChI=1/49C.Ir.4N.P.49H
charge 1 multiplicity 1
104 atoms
Ir -0.20817622 -0.23864972 0.31149534
H  0.37140085 -0.34813656 1.82755537
P  -0.67904096 2.04179993 0.72426406
C  0.58115612 -4.45306085 0.86515508
C  -0.2494182 -4.53154345 -0.19654764
H  1.05951932 -5.2139479 1.45900322
H  -0.65139086 -5.37558436 -0.73168966
N  0.7639464 -3.10672675 1.13034115
N  -0.5575076 -3.23224816 -0.55892681
C  0.06534739 -2.32638669 0.25242457
H  -1.55918927 -0.52237398 1.11974743
C  0.81210912 0.26242981 -2.48272517
C  -0.45085552 0.19629914 -1.83926873
C  -1.57321408 0.52367515 -2.60821879
C  -1.46578341 0.86200416 -3.95342707
C  -0.22512617 0.86371389 -4.58544035
C  0.9082002 0.57250987 -3.84589015
H  -1.3964277 -0.55598827 -0.71556252
H  -2.5607278 0.50709669 -2.15721613
H  -2.36347099 1.1113728 -4.51174042
H  -0.14235137 1.11343239 -5.63755653
H  1.89847117 0.61810178 -4.28802721
C  2.02761402 0.19602727 -1.68500942
C  -1.33138262 -2.93097914 -1.73344866
C  -2.70943112 -2.73197684 -1.61412275
C  -0.66132248 -2.876579 -2.96080763
C  -3.41766134 -2.44326696 -2.78008893
C  -1.41812385 -2.59538049 -4.09447412
C  -2.79292341 -2.37052542 -4.02523002
H  -4.48912431 -2.27165422 -2.71044564
H  -0.91451834 -2.52777053 -5.05553586
C  1.67779169 -2.64721831 2.14084854
C  1.18747408 -2.31939868 3.40999968
C  3.03647418 -2.59574229 1.82112122
C  2.10482845 -1.86942401 4.35502905
C  3.91665917 -2.1529284 2.81025087
C  3.47171037 -1.77790516 4.07665981
H  1.74428242 -1.59621992 5.34390103
H  4.97865376 -2.10286424 2.58132953
C  3.53154178 -3.0083844 0.46796217
H  2.95147273 -2.5476567 -0.33866225
H  4.57891113 -2.73614882 0.33135495
H  3.45394674 -4.09102612 0.3236875
C  4.43229441 -1.31943813 5.12992907
H  5.42023369 -1.11251914 4.71636688
H  4.07765877 -0.41638971 5.63255631
H  4.55614313 -2.08173205 5.90513605
C  -0.26527368 -2.46845364 3.7369705
H  -0.55746107 -3.52348193 3.7636416
H  -0.49547282 -2.0408437 4.71391693
H  -0.89995731 -1.9833615 2.9897267
C  0.81548363 -3.10972432 -3.04892097
H  1.35967569 -2.55437402 -2.27877612
H  1.06647335 -4.1670315 -2.91019973
H  1.20494404 -2.80214099 -4.02005536
C  -3.40045804 -2.84578471 -0.28996179
H  -2.86989623 -2.30434966 0.4981653
H  -4.41912486 -2.4592078 -0.34419923
H  -3.465487 -3.88966685 0.03510871
C  -3.57860744 -2.06483314 -5.26243817
H  -3.95641427 -2.98197357 -5.72566074
H  -4.4454636 -1.4368427 -5.04658904
H  -2.96643722 -1.55819188 -6.01165092
C  0.66617965 3.09543018 0.09160974
C  1.68190813 3.53300181 0.94806382
C  0.80082487 3.3024063 -1.28736361
C  2.8042662 4.17450732 0.43516133
H  1.59332467 3.37552662 2.01927318
C  1.92583285 3.94108616 -1.79421083
H  0.0241138 2.96347695 -1.96696877
C  2.93020347 4.37695321 -0.93494299
H  3.58041248 4.5199024 1.11011126
H  2.01593533 4.09687614 -2.86450216
H  3.80580001 4.87892062 -1.33264993
C  -1.1310702 3.90026978 2.7450602
C  -0.81349307 1.63888879 3.5226566
C  -1.30116987 4.32781418 4.05370687
H  -1.19321127 4.6194305 1.93242115
C  -0.98956926 2.0713636 4.83402999
H  -0.62495775 0.59193783 3.31545679
C  -1.23035579 3.41276745 5.10150647
H  -1.49324818 5.37564369 4.25755728
H  -0.93985167 1.35404669 5.64699927
H  -1.3675679 3.7482018 6.1239164
C  -2.22310887 2.64090294 -0.04778105
C  -2.32390865 3.87938633 -0.68572634
C  -3.36163954 1.83328915 0.05552217
C  -3.53506612 4.28767838 -1.23551611
H  -1.45777043 4.52914988 -0.75949942
C  -4.5714915 2.25046051 -0.48253928
H  -3.29615599 0.86993455 0.55459282
C  -4.65800665 3.47477842 -1.13883395
H  -3.59954742 5.2478796 -1.73605629
H  -5.44824867 1.61763447 -0.39205685
H  -5.6010561 3.79735349 -1.56677542
C  -0.87876084 2.55019 2.46844234
N  1.84469045 0.12477881 -0.33849581
C  4.28535522 0.38091224 -1.4648295
H  5.254026 0.44247913 -1.95637889
C  2.91558946 0.26539429 0.4539244
H  2.72827944 0.24404224 1.52295833
C  4.18286775 0.41423523 -0.07771919
H  5.04743775 0.5331707 0.56285587
N  3.22781886 0.28480075 -2.26364574
