program: Gaussian 16
title: [IrH(H)2(PhPm)(IMes)(PPh3)]
version: ES64L-G16RevC.01
method: RM06L
basis: GenECP
operation: Freq
keyword: #P
keyword: Geom=AllCheck
keyword: Guess=TCheck
keyword: SCRF=Check
keyword: GenChk
keyword: RM06L/GenECP
keyword: Freq
converged: YES YES YES YES
title: Mulliken charges:
elementType: Ir H P C C H H N N C H C C C C C C H H H H H C C C C C C C H H C C C C C C H H C H H H C H H H C H H H C H H H C H H H C H H H C C C C H C H C H H H C C C H C H C H H H C C C C H C H C H H H C N C H C H C H N
charge: 0.502117 -0.053423 0.589841 -0.028141 -0.028300 0.154761 0.156433 -0.350653 -0.343033 0.100473 0.097083 0.032195 -0.344929 -0.094007 -0.105138 -0.093171 -0.122191 -0.105881 0.123594 0.116415 0.121680 0.129552 0.395163 0.049599 0.026491 0.039959 -0.180323 -0.174004 0.023558 0.105815 0.105617 0.048542 0.026773 0.030795 -0.180618 -0.183752 0.010417 0.109320 0.108207 -0.247223 0.136556 0.127198 0.123783 -0.239319 0.111877 0.113407 0.143198 -0.278506 0.131346 0.128114 0.151776 -0.243961 0.120034 0.121010 0.129064 -0.261926 0.139809 0.116463 0.122261 -0.248423 0.119016 0.124355 0.122597 -0.213511 -0.128322 -0.093387 -0.096874 0.138768 -0.086380 0.156472 -0.098866 0.122112 0.125148 0.125506 -0.088550 -0.102062 -0.096740 0.141424 -0.103809 0.115727 -0.090985 0.128241 0.116343 0.129385 -0.264487 -0.118874 -0.098142 -0.080927 0.148116 -0.097264 0.167245 -0.095578 0.127994 0.118727 0.127607 -0.228014 -0.455702 0.094937 0.132332 0.096552 0.151064 -0.202767 0.135798 -0.337599
chargesum: 1.00000
title: Mulliken charges with hydrogens summed into heavy atoms:
elementType: Ir P C C N N C C C C C C C C C C C C C C C C C C C C C C C C C C C C C C C C C C C C C C C C C C C C N C C C N
charge: 0.439895 0.589841 0.126619 0.128133 -0.350653 -0.343033 0.100473 0.032195 -0.344929 0.029587 0.011276 0.028509 0.007362 0.395163 0.049599 0.026491 0.039959 -0.074507 -0.068388 0.023558 0.048542 0.026773 0.030795 -0.071299 -0.075544 0.010417 0.140314 0.129164 0.132730 0.126147 0.116608 0.117544 -0.213511 0.010446 0.063086 0.025238 0.038768 0.026640 0.052874 0.013665 0.031502 0.012534 0.038400 -0.264487 0.029242 0.069103 0.047067 0.021463 0.032029 -0.228014 -0.455702 0.227270 0.247616 -0.066969 -0.337599
polarizability: 6.67502496e+02 9.17538815e+01 5.73756748e+02 8.41874303e+00 1.68273405e+01 5.72258474e+02
1716.lowfreq: -3.7641 -0.0002 0.0006 0.0009 1.0974 3.3713 14.1336 21.1968 22.4490
redmass: 5.1750 3.8378 5.7021 4.9922 4.7214 2.6124 4.9910 3.6268 3.3909 3.2535 1.1909 3.3233 3.5779 3.4759 3.0543 3.5866 4.5851 2.8393 1.3698 4.2025 3.4276 2.7419 2.5830 2.5840 1.1894 2.2086 3.4533 2.1081 1.4871 4.4285 4.1976 5.8668 5.0093 4.5318 2.9064 3.0668 4.4632 4.8548 5.4162 5.1994 3.2947 4.4755 3.1821 5.1492 5.3176 4.3909 4.2637 6.7481 4.8680 2.5009 2.5115 5.0165 3.1858 2.9322 4.1214 4.8756 6.2608 4.9453 2.8966 2.8949 2.9360 5.1307 4.5072 4.6480 4.0276 4.1614 1.8518 4.4437 3.8423 3.1647 3.4071 4.9398 4.1909 3.2105 2.2310 3.0875 2.3628 3.8842 1.4401 4.1432 3.1116 4.4226 4.0020 3.5930 4.1213 3.8498 3.2579 5.9641 4.7883 5.9518 1.8802 3.4398 3.6962 7.2590 4.9487 6.8453 6.1315 2.7396 1.9216 2.0657 2.1879 3.7197 6.0280 1.6991 4.3082 3.5620 1.7185 4.4806 1.8513 1.8623 1.4377 5.9004 1.3277 1.2951 2.7872 1.2071 1.2487 1.2439 1.2557 1.2342 1.2578 1.2975 1.2978 1.3152 1.1280 1.3161 1.2987 1.3920 3.0504 2.7030 2.1220 2.1704 1.3923 1.4682 2.7866 1.3689 1.3650 1.4948 3.3116 1.3904 1.2743 1.2669 1.2837 1.2769 6.0923 6.0424 6.1303 8.6315 1.7641 1.8523 1.5474 1.5333 1.8368 2.3998 1.6020 1.5964 5.4831 1.5639 1.5900 1.5582 2.8763 2.9355 2.8623 1.8998 1.9433 1.6216 1.5066 1.9618 2.6605 1.6174 1.7177 1.6907 1.6477 2.6588 2.5523 2.6120 2.1747 1.8121 1.4536 1.1066 1.0805 1.0829 1.0817 1.5359 1.4504 1.1356 1.1346 1.1368 2.2524 1.6754 1.3708 1.3758 4.5334 1.6484 6.3060 1.6302 1.5436 3.8271 1.5417 3.4627 9.7537 3.1036 6.1537 6.2379 3.6007 4.1676 3.8390 4.3025 4.4457 1.2403 1.2381 1.2529 1.2783 1.4502 1.4692 2.7511 2.1488 1.8655 1.9722 2.3167 1.4699 2.1605 1.3592 2.1858 1.0530 2.2172 1.0574 2.3643 1.0509 1.0577 1.0710 1.0688 1.0721 1.0984 3.8752 1.5313 1.5974 2.0839 2.0828 2.0597 2.4399 2.4791 5.0818 5.7608 5.2077 5.3647 5.5073 5.7359 5.6364 6.0510 5.5919 7.2227 5.6407 5.6826 7.5966 5.9774 6.0273 1.0330 1.0127 1.0394 1.0415 1.0392 1.0413 1.0384 1.0393 1.0991 1.0991 1.0949 1.0971 1.0993 1.0950 1.0126 1.0900 1.0916 1.1017 1.1006 1.1025 1.0858 1.1014 1.1000 1.0998 1.0904 1.0860 1.0906 1.0906 1.0905 1.0875 1.0846 1.0856 1.0870 1.0860 1.0916 1.0898 1.0903 1.0898 1.0901 1.0943 1.0949 1.0936 1.0972 1.0992 1.0992 1.0991 1.0959 1.0902 1.1125
irintensity: 0.0156 0.0946 0.0729 0.1088 0.0830 0.2713 0.1215 0.2901 0.0720 0.3361 0.3167 0.5046 0.4346 0.1213 0.1402 0.0114 0.1220 0.1877 0.2384 0.2733 0.1211 0.2907 0.7877 0.9677 0.4108 0.7838 0.3180 1.8884 0.1803 0.3820 0.2074 0.1041 0.0533 0.6693 3.7577 8.6761 2.2359 1.0992 1.1254 1.4811 0.3543 0.8443 0.1159 1.1577 0.8772 0.2518 0.1987 1.1378 0.2529 0.0675 0.2542 0.7122 0.7416 0.4034 0.0940 1.9544 1.4224 0.1888 0.1730 0.1634 0.2677 8.0219 1.2544 3.5761 3.9962 3.8546 8.6619 7.2289 1.7282 3.1313 1.7083 20.4035 8.6288 35.0695 10.4211 0.0444 2.6277 115.5308 17.7378 0.0113 1.3145 1.5111 0.5868 6.0696 4.6346 2.2393 2.8834 1.7831 0.7922 1.9529 16.9799 8.9069 3.3871 6.7354 0.6715 1.6687 4.3135 27.7463 67.1413 4.7078 20.3823 15.0104 12.5484 9.0763 1.3403 2.6222 9.3147 0.2503 12.7074 14.2291 76.3374 2.5129 10.1536 0.1332 13.9784 11.7351 1.4542 1.7307 19.8326 3.4580 16.3630 0.9248 0.4818 2.6075 55.9551 0.3028 0.2284 2.5011 14.3319 5.9841 0.8804 2.6382 4.0612 0.6373 2.1457 0.2068 0.2131 2.5255 1.7257 1.4364 0.1772 4.6143 0.0158 0.3170 4.5395 2.6292 4.7809 1.3045 5.8909 5.0144 2.0489 0.6801 6.1660 1.4228 15.3277 2.9277 2.1244 11.4316 2.4088 2.5945 0.8015 0.2247 0.2940 0.8171 0.5397 3.5744 19.8049 2.2474 3.8901 1.6434 8.8949 0.1384 1.2958 22.5157 22.9180 15.5861 3.1017 0.8179 2.0867 1.3531 0.6740 0.4197 0.4556 2.1392 0.1503 1.4650 2.3405 0.3385 34.2094 3.8311 0.6088 0.0616 6.1079 9.6145 18.5095 5.5016 3.3420 1.2086 2.4720 2.7847 44.2747 5.7618 1.3450 2.1631 0.5930 1.5404 4.7283 2.1461 2.9006 0.8927 10.6261 1.2833 5.4129 16.8159 2.6360 35.4259 85.1224 0.5389 2.0420 51.1199 0.8925 19.7529 0.4364 10.3617 7.1142 13.6210 24.7522 17.4157 10.0334 0.8717 9.2295 5.2385 4.4211 2.4252 96.8213 12.8885 23.6922 6.5447 4.8651 7.4487 106.2024 4.7000 33.5661 21.9478 3.8920 1.8570 4.4303 93.2037 43.8008 19.0192 0.5873 3.6195 1.2735 0.5068 9.5348 31.7563 12.9007 12.0456 98.7612 17.4575 20.6690 14.5901 14.7682 23.8469 11.3951 4.9218 11.3851 18.2144 7.7197 7.7906 11.8298 30.0034 16.2514 6.2762 8.4966 6.0416 5.2162 10.2693 11.9971 10.2123 3.0680 15.6610 1.8790 11.0591 8.3789 8.9007 0.9837 1.4313 0.2081 0.4762 0.5731 8.3442 1.8397 0.1783 4.4260 6.8779 8.6619 10.9920 6.6738 11.3932 13.8329 14.8583 17.0265 2.2494 4.8121 2.3055
temp: 298.150 k
press: 1.00000 atm
elementType: 77 1 15 6 6 1 1 7 7 6 1 6 6 6 6 6 6 1 1 1 1 1 6 6 6 6 6 6 6 1 1 6 6 6 6 6 6 1 1 6 1 1 1 6 1 1 1 6 1 1 1 6 1 1 1 6 1 1 1 6 1 1 1 6 6 6 6 1 6 1 6 1 1 1 6 6 6 1 6 1 6 1 1 1 6 6 6 6 1 6 1 6 1 1 1 6 7 6 1 6 1 6 1 7
symmnumber: 1
zpe: 2226589.4 jmol-1
zpe.correction: 0.848063 hartree
zpe.thermalcorrener: 0.900457 hartree
zpe.thermalcorrenthalpy: 0.901402 hartree
zpe.thermalcorrgfe: 0.759254 hartree
zpe.sumelectzpe: -2560.829921 hartree
zpe.sumelectthermal: -2560.777527 hartree
zpe.sumelectthermalent: -2560.776583 hartree
zpe.sumelectthermalfe: -2560.918730 hartree
dipole: 3.1443 0.3721 1.6389
dipole: 3.5652
quadrupole: -260.2153 -281.3773 -307.2369
quadrupole: 10.8706 2.8780 0.2275
quadrupole: 22.7279 1.5658 -24.2937 10.8706 2.8780 0.2275
hfenergy: -2561.6779846 hartree
pointgroup: C01 [X(C49H49Ir1N4P1)]
dipole: 1.2454368 0.125466 0.8819417 debye
polarizability: 667.5024957|91.7538815|573.7567477|8.418743|16.8273405|572.2584737 unknown
InChI: InChI=1/49C.Ir.4N.P.49H
charge 1 multiplicity 1
104 atoms
Ir 0.11798036 -0.1799986 0.3731398
H  1.12196471 0.47725829 1.71205429
P  -1.35583369 1.68993538 0.34982164
C  2.90929759 -3.41303661 1.03337708
C  1.77493338 -4.13399272 0.90692107
H  3.92341778 -3.7013235 1.25436817
H  1.58421892 -5.19056089 0.99512251
N  2.5614816 -2.09013315 0.81709717
N  0.76040544 -3.23988809 0.61489739
C  1.22749146 -1.95810125 0.5512232
H  0.44925304 0.12542256 2.10125262
C  0.00263293 -0.26441829 -2.58429717
C  -0.69500012 -0.70647371 -1.435296
C  -1.90222025 -1.38082342 -1.63773319
C  -2.37206362 -1.64444321 -2.92060365
C  -1.64865558 -1.24126445 -4.04471704
C  -0.46547061 -0.5438931 -3.87585553
H  -1.00550003 -0.98820298 1.14374889
H  -2.48168682 -1.71699588 -0.78272659
H  -3.31264397 -2.17516315 -3.04401848
H  -2.01904167 -1.45760614 -5.04079142
H  0.10253815 -0.17681086 -4.72452363
C  1.1500265 0.60274278 -2.38082138
C  -0.59284099 -3.67720393 0.39237077
C  -1.50730576 -3.63500014 1.44902989
C  -0.91914079 -4.18552517 -0.86825103
C  -2.81157113 -4.05114654 1.18426976
C  -2.2252709 -4.62628571 -1.06701148
C  -3.19158894 -4.5430138 -0.06522426
H  -3.54441054 -4.01214824 1.98695698
H  -2.50145488 -5.01372578 -2.04452953
C  3.537977 -1.03686295 0.83390596
C  3.78411334 -0.33815256 2.01875838
C  4.26763153 -0.80638021 -0.34070084
C  4.76955627 0.65357626 1.98896867
C  5.25983058 0.16739764 -0.30557482
C  5.5222178 0.91421312 0.84619516
H  4.97142197 1.21463141 2.89834448
H  5.83185828 0.36316987 -1.20953126
C  3.96878946 -1.57198368 -1.59257432
H  4.29478337 -2.61464429 -1.51696135
H  2.89463488 -1.59922731 -1.80332722
H  4.47408423 -1.13283097 -2.4536384
C  6.60107714 1.95274007 0.84882565
H  6.56188778 2.57815678 -0.04691451
H  6.53743929 2.6037668 1.72164098
H  7.59151801 1.48766961 0.86017492
C  3.08022597 -0.65741021 3.30368951
H  2.75385385 0.25185441 3.8157335
H  2.21026185 -1.30008977 3.16265146
H  3.75666773 -1.17581759 3.99043769
C  0.08436166 -4.19998746 -1.97856313
H  0.95749762 -4.81574822 -1.74039306
H  -0.35462791 -4.58508785 -2.89922684
H  0.45351036 -3.18854884 -2.18336076
C  -1.10164563 -3.21959574 2.83019338
H  -0.6444933 -4.05781398 3.36772825
H  -0.37302149 -2.40659778 2.82532845
H  -1.96527518 -2.89715763 3.41445307
C  -4.61044751 -4.93801516 -0.33461081
H  -5.11739246 -5.27692091 0.57061151
H  -5.18225854 -4.08766425 -0.72350969
H  -4.67567808 -5.73295781 -1.07960418
C  -1.1705191 2.72216016 -1.14959215
C  -0.34649789 3.85126692 -1.16602375
C  -1.77304254 2.30215324 -2.34257468
C  -0.13096246 4.54642401 -2.35135236
H  0.11681893 4.20428804 -0.25000556
C  -1.55468578 3.00079347 -3.52283982
H  -2.41424086 1.42479527 -2.34924273
C  -0.73142772 4.12197456 -3.53129949
H  0.50147011 5.42815705 -2.3478161
H  -2.02727843 2.66156146 -4.43871636
H  -0.56343349 4.66650338 -4.45430077
C  -2.15739427 3.38029508 2.47884624
C  0.21460329 3.18733418 2.10972175
C  -1.9140222 4.25166133 3.53586187
H  -3.17943404 3.11731636 2.22752467
C  0.45431779 4.06674485 3.15705186
H  1.05453535 2.77092511 1.55811255
C  -0.61238513 4.59876093 3.87524513
H  -2.74887424 4.65931928 4.0955847
H  1.47339561 4.33471319 3.41569431
H  -0.42738646 5.27951421 4.69901519
C  -3.13831274 1.29316741 0.39732115
C  -4.07607396 2.19467321 -0.12214445
C  -3.59392947 0.12159199 1.00823736
C  -5.43546893 1.91862953 -0.04505092
H  -3.74201396 3.11556846 -0.59036789
C  -4.95461633 -0.15221268 1.08212605
H  -2.88109975 -0.58617687 1.41908841
C  -5.87738817 0.74302065 0.55323116
H  -6.15029567 2.62417929 -0.45453082
H  -5.29217685 -1.07020638 1.5526381
H  -6.93906284 0.52709199 0.60755481
C  -1.09410269 2.83856146 1.75222426
N  1.4881716 0.83386914 -1.07953254
C  2.75784473 2.01191089 -3.16274738
H  3.2496927 2.45760772 -4.0252786
C  2.48389576 1.6933252 -0.84216643
H  2.75634804 1.84464142 0.20048564
C  3.15254598 2.3347535 -1.86870273
H  3.95444413 3.03325408 -1.66517531
N  1.77755451 1.15486738 -3.42413309
