program: Gaussian 16
title: IrH2CHCl3PhOxIMesPPh3_25_opt
version: ES64L-G16RevC.01
method: RM06L
basis: GenECP
operation: Freq
keyword: #P
keyword: Geom=AllCheck
keyword: Guess=TCheck
keyword: SCRF=Check
keyword: GenChk
keyword: RM06L/GenECP
keyword: Freq
converged: YES YES YES YES
title: Mulliken charges:
elementType: C C C C C C H C H H H C H H H C C H H C H H H H N N C C H C C H H H C C C H H H H C C H H H Ir H H C P C C C C C C C C C C H C H C H C H C H C H C H H C H H C H H H H H Cl C H Cl C C C C H C H C H H H N C C H H C O H H Cl
charge: 0.037351 0.051866 0.039939 -0.173634 0.020440 -0.213870 0.110901 -0.237896 0.134136 0.114655 0.116379 -0.247532 0.113210 0.141254 0.114014 -0.039691 -0.021433 0.150234 0.152511 -0.245820 0.143781 0.125686 0.121724 0.110834 -0.350501 -0.335892 -0.185166 -0.190599 0.103594 0.047371 -0.260086 0.115624 0.136672 0.135059 0.039295 0.046162 -0.233009 0.118898 0.122917 0.125542 0.100976 0.013145 -0.254595 0.106368 0.139809 0.123614 0.486368 -0.060732 -0.129092 0.069564 0.533093 -0.276383 -0.215655 -0.235648 -0.081921 -0.127294 -0.125205 -0.139432 -0.089843 -0.098614 -0.092868 0.135431 -0.098254 0.185020 -0.090638 0.127188 -0.111492 0.151979 -0.083172 0.133327 -0.112352 0.172433 -0.087396 0.128548 0.123788 -0.111864 0.126509 0.132539 -0.104785 0.126213 0.129758 0.130653 0.131010 0.124677 -0.060005 -0.371627 0.300136 0.013871 -0.021436 -0.120634 -0.101632 -0.078167 0.130329 -0.123691 0.132906 -0.104223 0.127687 0.138791 0.127896 -0.430833 -0.156247 0.021793 0.149142 0.131062 0.348308 -0.336289 0.162159 0.136452 0.024562
chargesum: 1.00000
title: Mulliken charges with hydrogens summed into heavy atoms:
elementType: C C C C C C C C C C C N N C C C C C C C C C Ir C P C C C C C C C C C C C C C C C C C C Cl C Cl C C C C C C N C C C O Cl
charge: 0.037351 0.051866 0.039939 -0.062801 0.020440 -0.102969 0.127274 0.120946 0.110543 0.131078 0.145371 -0.350501 -0.335892 -0.081572 -0.089623 0.047371 0.127268 0.039295 0.046162 0.134348 0.013145 0.115197 0.296545 0.069564 0.533093 -0.276383 -0.215655 -0.235648 0.053509 0.057726 0.001983 0.012547 0.043485 0.073819 0.035680 0.025534 0.035871 0.021046 0.043041 0.017406 0.043257 0.019146 0.019892 -0.060005 -0.071492 0.013871 -0.021436 0.009696 0.031274 0.049520 0.015100 0.023672 -0.430833 0.155054 0.289307 0.348308 -0.336289 0.024562
polarizability: 6.54588682e+02 -2.62148245e+01 5.79245848e+02 1.43272833e+01 -1.40949328e+01 6.94996016e+02
1716.lowfreq: -1.6028 -0.0013 -0.0008 -0.0006 2.4866 3.9899 15.8335 19.2667 21.8803
redmass: 8.0545 4.1921 5.5168 1.1807 5.0532 6.4258 6.9614 5.7061 5.1391 5.4412 4.6195 6.5570 4.3655 4.6105 6.4782 5.4960 5.5295 5.5108 4.6215 8.1635 6.2016 3.5066 5.4428 3.5022 3.7332 2.2369 1.7904 4.3115 1.5132 4.0320 3.7884 2.7086 3.0880 4.7607 2.9802 1.6215 2.9774 3.1924 3.9808 4.6802 2.7106 3.5789 2.8733 2.8401 2.2909 1.9056 3.2072 4.9191 2.9253 3.3247 3.4868 4.6113 4.8131 4.9669 3.7896 16.5741 7.9150 2.5132 2.5275 4.8417 3.1049 3.3097 2.8939 5.7474 4.1875 9.9022 6.1286 4.8588 2.9120 3.5394 3.2182 3.0416 3.0514 5.3898 5.5362 4.8088 5.7731 4.2835 3.3674 3.5684 5.4586 3.1114 4.0416 4.1581 3.1442 5.7173 4.1272 4.5037 4.0268 4.0884 3.5991 4.0824 3.1209 1.2523 6.1576 6.3146 5.9378 5.8144 5.7297 4.7277 5.0977 5.9922 5.6624 4.6740 2.8268 3.6044 2.2200 2.4131 4.7665 2.2308 2.8688 2.3745 1.9030 4.4374 1.6536 4.3762 1.8787 1.7427 5.4420 8.7632 2.3863 1.2905 1.1868 1.1711 1.2175 1.2294 1.2313 1.2461 1.1883 1.2154 1.2637 1.1330 1.2862 1.3319 1.3589 1.3682 5.5493 2.4366 1.3397 1.4527 2.2067 2.1057 2.2492 5.6816 3.5755 1.3689 1.3956 2.4377 1.6711 1.3520 1.2743 1.2805 1.2884 1.2681 5.6271 5.8356 6.0528 4.3798 5.3454 1.6594 1.7541 2.9495 1.6471 1.6223 1.5787 1.5705 1.5582 1.8711 2.0104 2.6093 2.4322 1.6105 2.3013 1.7597 1.9025 1.9645 1.8251 1.6351 1.9427 2.0183 1.9991 1.7939 1.7758 1.6219 2.6976 2.7034 2.9082 3.5546 1.0883 1.0840 1.0818 1.0811 1.5205 1.4469 1.1250 1.1334 1.1370 1.1347 1.0704 1.1094 1.0711 2.3614 1.0877 1.3643 1.3595 1.9151 6.1859 1.6880 1.5335 3.5861 1.4561 1.4587 3.5565 8.9537 1.5902 6.1423 3.6573 5.7467 4.2344 4.4476 4.3257 5.1349 1.2772 2.2517 1.2645 1.2734 1.2893 1.4620 1.4724 2.7809 1.9195 1.9625 1.4050 2.1673 1.2811 2.1972 1.0858 2.1922 1.0849 1.0442 1.1965 1.6642 1.0955 1.0926 1.1028 1.0756 1.1017 1.4524 1.5263 1.1803 2.0744 2.0887 2.0625 2.5224 2.4691 2.5033 5.2135 5.2901 5.5288 5.5751 5.8431 5.6504 5.6004 5.6298 7.4655 7.7073 6.1813 6.0234 6.0152 8.3028 1.0130 1.0127 1.0394 1.0388 1.0393 1.0404 1.0379 1.0393 1.0606 1.0587 1.0990 1.1042 1.0982 1.0971 1.0987 1.0998 1.0961 1.1100 1.1018 1.1017 1.1020 1.0888 1.1021 1.0979 1.0994 1.0940 1.0909 1.0905 1.0861 1.0865 1.0906 1.0873 1.0847 1.0864 1.0856 1.0867 1.0902 1.0898 1.0906 1.0895 1.0941 1.0940 1.0948 1.0937 1.0990 1.0989 1.0992 1.0976 1.0897 1.0900 1.1122
irintensity: 0.2067 0.0944 0.1737 0.3367 0.2442 0.0200 0.2450 0.2005 0.0422 0.0337 0.1844 0.0935 0.3203 0.2009 0.3715 0.2884 0.1682 0.1337 0.1591 0.1057 0.3882 0.0355 0.3056 0.4393 0.6361 0.1782 0.6964 0.2656 0.7607 0.7857 0.3808 0.4303 1.2430 2.4242 0.3370 0.6081 0.1361 0.2218 0.3243 0.1537 1.1537 1.5780 1.1091 5.1082 1.3476 5.0872 1.1534 0.8160 0.1220 3.2735 0.2129 0.8984 0.1202 0.3642 0.0394 0.9247 0.4012 0.1748 0.3109 0.1637 0.3900 2.3508 0.1419 0.1705 0.1651 0.0846 3.3425 0.0354 0.1098 1.8404 1.6581 0.8241 0.5043 14.9581 2.6735 4.0725 11.8383 3.2011 1.3568 5.6738 20.4707 0.2885 13.3580 30.7913 3.1256 103.9836 0.1185 1.4686 0.7257 2.9988 4.4124 2.3387 1.3054 7.4202 0.7780 0.2750 1.7469 2.2649 89.0734 1.0712 0.4546 3.4358 9.1026 11.5472 26.3549 29.3783 64.1103 38.3864 112.8021 17.7142 16.2449 8.6327 6.1155 0.8856 15.6623 1.3213 11.8729 11.9392 5.6959 162.5072 11.5116 0.1092 1.9432 9.7017 5.5908 11.3143 10.6674 19.0439 4.1221 6.6396 1.0129 4.2978 0.9468 18.0741 11.9921 0.6673 14.7204 11.1721 0.2475 14.1156 1.5435 1.8119 1.0600 32.6097 3.9378 0.3385 0.1612 0.3219 1.3796 0.0468 0.3513 0.0595 0.1958 0.0660 5.2826 2.6125 2.2615 8.5210 6.6053 11.1656 7.4019 1.0135 0.6889 1.3611 3.0582 14.2633 3.5995 0.3887 9.9459 1.8088 0.9988 3.0921 1.3225 1.4284 0.0630 0.1713 1.6759 3.0665 3.6747 19.2631 12.8110 7.3114 7.5874 1.6342 28.4914 7.9242 2.9460 50.8268 0.1444 0.0552 0.2096 0.2729 1.9255 0.3449 2.5520 1.0634 3.0144 2.7511 47.0460 4.4403 25.1858 33.7311 0.7234 0.0922 0.1194 44.0572 25.0338 0.5452 9.5643 3.9115 3.0211 0.7743 7.8553 56.3112 23.6647 0.4193 0.9091 3.9671 0.2910 0.1824 0.8433 6.3533 0.4968 55.0522 6.4655 0.9668 5.8671 8.9110 3.7052 71.0833 0.2934 3.4817 5.9226 3.1720 2.1084 34.0089 17.5903 6.1545 8.4619 7.0005 2.7105 15.9522 8.2218 16.3031 6.5721 1.1833 3.2204 8.7587 23.1800 18.3989 5.8915 6.7852 12.0940 97.3621 17.3793 9.5743 5.4639 0.1377 0.6120 0.0461 16.4195 0.2704 0.4628 0.6029 2.5284 7.3846 15.0419 36.7515 5.4187 169.8239 107.9277 25.9941 16.3140 9.3926 16.2620 15.5341 23.1120 20.2868 13.4401 33.3249 8.9914 0.7497 5.7931 6.4133 9.8992 10.6964 11.5520 9.0152 8.1266 8.7584 9.6926 36.4662 8.7500 4.4041 4.1474 13.9494 17.4511 9.8767 4.3816 1.4169 9.7546 3.5963 0.5352 0.2475 0.3450 0.4730 0.5841 0.7826 0.0546 2.7427 11.3163 8.2234 9.8813 10.0526 11.7972 15.7424 16.3884 8.8052 1.5194 4.4731 1.4727
temp: 298.150 k
press: 1.00000 atm
elementType: 6 6 6 6 6 6 1 6 1 1 1 6 1 1 1 6 6 1 1 6 1 1 1 1 7 7 6 6 1 6 6 1 1 1 6 6 6 1 1 1 1 6 6 1 1 1 77 1 1 6 15 6 6 6 6 6 6 6 6 6 6 1 6 1 6 1 6 1 6 1 6 1 6 1 1 6 1 1 6 1 1 1 1 1 17 6 1 17 6 6 6 6 1 6 1 6 1 1 1 7 6 6 1 1 6 8 1 1 17
symmnumber: 1
zpe: 2305492.6 jmol-1
zpe.correction: 0.878116 hartree
zpe.thermalcorrener: 0.936506 hartree
zpe.thermalcorrenthalpy: 0.937451 hartree
zpe.thermalcorrgfe: 0.780856 hartree
zpe.sumelectzpe: -3963.089937 hartree
zpe.sumelectthermal: -3963.031546 hartree
zpe.sumelectthermalent: -3963.030602 hartree
zpe.sumelectthermalfe: -3963.187197 hartree
dipole: 2.3460 -0.6520 -0.5636
dipole: 2.4993
quadrupole: -322.1019 -321.8835 -318.5675
quadrupole: -10.6002 10.5700 1.2057
quadrupole: -1.2509 -1.0325 2.2835 -10.6002 10.5700 1.2057
hfenergy: -3963.9680526 hartree
pointgroup: C01 [X(C49H51Cl3Ir1N3O1P1)]
dipole: 0.7328386 -0.321365 -0.1967643 debye
polarizability: 654.5886818|-26.2148245|579.2458478|14.3272833|-14.0949328|694.9960157 unknown
InChI: InChI=1/49C.3Cl.Ir.3N.O.P.51H
charge 1 multiplicity 1
109 atoms
C  2.84461941 -3.24046835 0.67517159
C  1.50134806 -3.33029082 1.06683624
C  1.11710509 -3.49183182 2.399719
C  2.12481822 -3.47418417 3.36762045
C  3.47164796 -3.36382264 3.02861867
C  3.81122837 -3.27026014 1.67539231
H  4.8602958 -3.22006017 1.39136334
C  4.53860572 -3.35162833 4.07947577
H  5.28336947 -4.13135265 3.89957367
H  5.07929965 -2.3996375 4.08735349
H  4.12707599 -3.50525292 5.07743971
C  3.22308494 -3.15355297 -0.77136215
H  4.26382738 -2.84535337 -0.88647725
H  3.11233613 -4.12211144 -1.27097397
H  2.59084954 -2.44732041 -1.31733697
C  0.11514864 -4.52378808 -0.59344698
C  -0.75690732 -4.16990983 -1.56229823
H  0.49853119 -5.48330468 -0.28847004
H  -1.29552089 -4.75651663 -2.2877838
C  -0.30970886 -3.7419454 2.77833785
H  -0.52871899 -4.81526167 2.75432948
H  -0.5201862 -3.39367094 3.79165487
H  -1.01224497 -3.2570845 2.0975499
H  1.84550641 -3.57395883 4.41340466
N  0.50216531 -3.35263963 0.03834824
N  -0.8858334 -2.79502582 -1.50080681
C  -3.70121481 -0.98734089 -3.09375647
C  -1.76656034 -0.82755774 -4.50255661
H  -4.74524989 -0.7549594 -2.89740262
C  -3.00257336 -1.76282504 -2.17127766
C  -3.66504309 -2.29595758 -0.93891949
H  -4.58444461 -1.75079555 -0.71694457
H  -3.93423646 -3.35108324 -1.05877682
H  -3.00860502 -2.2310 -0.06749541
C  -1.66024254 -2.03756686 -2.44611283
C  -1.0220778 -1.59750216 -3.60875024
C  0.41175556 -1.94100353 -3.87011716
H  0.74588976 -1.54594648 -4.82965699
H  1.06667547 -1.52972566 -3.09360978
H  0.57299867 -3.02397352 -3.8769901
H  -1.28754065 -0.47162165 -5.4120322
C  -3.10308833 -0.50943238 -4.26194461
C  -3.89281822 0.31207364 -5.23470288
H  -3.27487213 0.66839479 -6.06074664
H  -4.713873 -0.26734482 -5.6666546
H  -4.34617401 1.18168822 -4.7498268
Ir -0.11791556 -0.23665779 -0.03316138
H  -0.11091398 -0.05534095 -1.57106252
H  -1.68239403 -0.41897078 -0.15299881
C  -0.11001201 -2.25796899 -0.50524291
P  -0.51896865 2.07229566 0.18420171
C  -2.0838655 2.59175697 0.99777248
C  0.81129769 2.90705539 1.11491313
C  -0.67481752 2.97409551 -1.40507976
C  -2.19549072 3.81398516 1.67202937
C  -3.22470571 1.79325512 0.85333503
C  0.76421939 2.9917767 2.51200701
C  2.00672645 3.23632848 0.46278194
C  -0.29072298 4.31053836 -1.54640676
C  -1.28225094 2.31911335 -2.48259925
C  -3.40731994 4.20027949 2.23172052
H  -1.33292109 4.4666694 1.76421322
C  -4.4366505 2.18623932 1.41054131
H  -3.1565898 0.85260332 0.31440626
C  1.87372241 3.41711387 3.23462888
H  -0.14423427 2.72479938 3.04501424
C  3.11643286 3.655134 1.1869177
H  2.07212652 3.16440544 -0.61976659
C  -0.47926614 4.96923127 -2.75631383
H  0.16162804 4.84022403 -0.71330718
C  -1.47870296 2.98624382 -3.68585992
H  -1.59692882 1.28317208 -2.38205934
C  -4.52782613 3.3841305 2.11031889
H  -3.47683915 5.14452464 2.76108093
H  -5.30861155 1.54962085 1.30098181
C  3.05280572 3.74838163 2.57459967
H  1.81487448 3.48901443 4.31550408
H  4.03208291 3.91242568 0.66385245
C  -1.07004576 4.30861127 -3.82823354
H  -0.16786529 6.00325135 -2.85883933
H  -1.94596001 2.46542721 -4.51575749
H  -5.4708146 3.6866273 2.55260762
H  3.91679989 4.08362769 3.13855957
H  -1.216864 4.82641225 -4.77014538
Cl -0.16396805 -0.483591 2.73500304
C  -1.8330849 -0.03070769 3.29707978
H  -2.05069205 0.93335248 2.84195514
Cl -3.02669522 -1.18716262 2.71814803
C  3.07231835 0.33393323 -2.11280757
C  4.07470398 -0.23201108 -2.90873645
C  2.05748394 1.08215379 -2.71386775
C  4.03272051 -0.08124937 -4.28790021
H  4.88103344 -0.78561353 -2.44065643
C  2.02993114 1.24703625 -4.09177251
H  1.30102724 1.54909663 -2.09758261
C  3.01276057 0.65812887 -4.88121646
H  4.80539503 -0.53098644 -4.90163748
H  1.24190473 1.84241793 -4.54210011
H  2.99311295 0.78409131 -5.95871863
N  2.15571266 0.03667763 0.17372654
C  2.73965849 0.03198998 1.52597808
C  4.24602993 0.12816678 1.295526
H  2.45661305 -0.88755196 2.04961209
H  4.79746315 -0.75967879 1.61221109
C  3.13184392 0.19122473 -0.65646939
O  4.37287012 0.23984803 -0.14220934
H  2.34449745 0.879374 2.09521429
H  4.70526122 1.01452938 1.73655732
Cl -1.83960722 0.13084947 5.04214252
