program: Gaussian 09
title: 000060993
version: EM64L-G09RevD.01
frameworkgroup: C1[X(C6H16N2)]
method: RPBEPBE
basis: SDD
operation: Freq
keyword: #pfreq=noraman
keyword: PBEPBE/SDD
title: #p freq=noraman PBEPBE/SDD
converged: YES YES NO NO
title: Mulliken charges:
elementType: N N C C C C C C H H H H H H H H H H H H H H H H
charge: -0.103478 -0.542748 -0.335078 -0.321116 -0.324502 -0.409662 -0.671833 -0.672964 0.178731 0.192672 0.202545 0.185293 0.205575 0.185634 0.225285 0.204504 0.206023 0.228470 0.204614 0.206977 0.228545 0.204719 0.260063 0.261730
chargesum: 0.00000
title: Mulliken charges with hydrogens summed into heavy atoms:
elementType: N N C C C C C C
charge: -0.103478 -0.020955 0.036325 0.066722 0.066707 0.020127 -0.032727 -0.032722
polarizability: 9.04924769e+01 1.13521585e+00 8.45139212e+01 1.39589835e+00 -9.23541562e-01 6.93533982e+01
1716.lowfreq: -9.7546 -4.7654 -0.0003 0.0001 0.0002 5.5983 66.8555 72.3661 82.0632
frequency: 66.8011 72.3590 82.0497 91.3908 167.9087 208.6955 243.2574 257.6615 277.5426 293.8455 357.3641 392.9228 447.6363 495.9373 586.4796 745.4399 764.7795 793.5320 797.7215 906.6279 961.8657 985.2151 1025.2888 1069.7287 1074.7005 1084.2267 1086.7483 1092.1960 1139.6239 1204.1109 1220.3424 1275.5205 1283.0130 1288.8468 1312.9425 1326.9510 1357.9650 1363.2388 1373.0587 1385.4038 1387.0927 1455.3148 1461.8473 1465.4354 1470.0791 1477.7484 1479.5371 1485.6401 1489.7508 1644.4531 2838.7968 2843.8202 2858.4276 2981.3423 2982.8076 2997.9762 3021.3887 3026.0213 3030.8256 3065.5853 3073.2379 3075.0940 3091.3427 3092.0360 3454.6013 3580.4390
redmass: 2.2939 2.8265 1.9565 1.8587 1.4772 1.2305 1.7772 1.3045 1.5281 1.9064 2.4864 2.9957 2.6206 2.4478 1.5252 2.2238 1.2169 1.1343 1.2251 1.8271 1.2621 2.2871 3.6119 2.5490 1.8489 2.3439 2.2052 2.4937 1.5896 2.2955 2.0590 1.1335 1.2107 1.2405 1.2456 1.2408 1.3385 1.3186 1.3617 1.2339 1.2319 1.0696 1.0544 1.0690 1.0568 1.0570 1.0686 1.0663 1.0741 1.0901 1.0713 1.0722 1.0711 1.0357 1.0357 1.0633 1.0853 1.0872 1.0873 1.1037 1.0986 1.0981 1.1002 1.1003 1.0444 1.0976
irintensity: 0.4577 1.1825 0.5301 1.4290 1.8773 0.1090 8.1591 33.4783 19.0418 0.9570 9.1048 5.0483 4.4063 21.4803 327.7605 7.0784 2.4247 4.5270 7.9708 1.0917 0.7434 6.0387 13.9859 39.5893 14.6279 4.8389 8.5008 29.0463 7.0336 25.6352 18.2771 2.6323 11.8562 22.3977 0.6853 0.1967 2.5184 3.0865 1.3704 21.1532 22.2442 3.0713 5.8418 0.4379 2.0421 2.7118 14.8074 8.7669 12.4054 32.5801 45.7660 35.5860 251.3476 35.2513 29.8898 31.9129 15.6211 24.6034 23.9114 40.9565 48.2193 80.5306 32.6239 49.7752 1.2079 0.1529
temp: 298.150 k
press: 1.00000 atm
elementType: 7 7 6 6 6 6 6 6 1 1 1 1 1 1 1 1 1 1 1 1 1 1 1 1
symmnumber: 1
zpe: 572960.9 jmol-1
zpe.correction: 0.218229 hartree
zpe.thermalcorrener: 0.229355 hartree
zpe.thermalcorrenthalpy: 0.230299 hartree
zpe.thermalcorrgfe: 0.181588 hartree
zpe.sumelectzpe: -347.008661 hartree
zpe.sumelectthermal: -346.997536 hartree
zpe.sumelectthermalent: -346.996592 hartree
zpe.sumelectthermalfe: -347.045302 hartree
dipole: -0.7197 0.6152 1.8316
dipole: 2.0618
quadrupole: -55.1686 -50.2025 -53.7683
quadrupole: 3.0817 4.4883 -1.2301
quadrupole: -2.1222 2.8440 -0.7218 3.0817 4.4883 -1.2301
hfenergy: -347.2268906 hartree
pointgroup: C01 [X(C6H16N2)]
dipole: -0.2880052 0.2489014 0.7163339 debye
dipolederiv: -0.7382367 0.0631357 0.0161049 -0.0653514 -0.6710996 0.0116178 0.0022232 0.0101506 -0.5323296 -0.9928866 0.0967732 0.1849578 0.1569012 -0.2633095 -0.1619889 0.2687387 -0.1500133 -0.417172 0.4330989 0.0629567 0.12509 0.0740368 0.0803183 -0.1029106 0.1539332 -0.0892953 0.3286522 0.2558641 -0.245751 -0.0128349 -0.2705393 0.4175926 0.1124431 -0.0044369 0.0857466 0.3975154 0.1878337 0.204158 -0.1019641 0.2171088 0.501654 -0.0679298 -0.0826024 -0.0445302 0.4035323 0.6069673 0.0028224 -0.0266549 0.0601393 0.2277989 0.0786173 0.0145033 0.0471036 0.2297272 0.0871264 0.0051717 -0.017963 0.0331229 -0.0862868 0.0693211 0.005096 0.0770221 -0.006369 -0.0268463 -0.1012493 -0.0466651 -0.0787786 0.0160944 -0.0535657 -0.0674702 -0.0382171 -0.0036233 -0.0895197 0.0059501 -0.0418371 0.0678507 0.0331767 0.1133911 -0.1307214 0.0495039 -0.2483461 0.0359768 -0.0502191 0.0084373 -0.0573117 -0.1780567 -0.0281798 0.0195917 0.003955 0.0546158 -0.1708305 -0.0669868 0.0008088 -0.0815459 0.0225496 0.0165045 -0.0219061 0.0072541 0.0613755 0.037138 0.0316036 -0.0576769 0.0777208 -0.0767084 -0.0452745 0.0615672 -0.1282501 -0.2792713 -0.1015951 0.1177022 -0.0224787 0.1037834 -0.0433245 -0.0002692 -0.0030934 -0.0174884 0.0608849 -0.0073454 -0.096408 0.0741018 -0.0520813 -0.0307965 -0.0418499 0.0964641 0.1002521 -0.2789383 0.0166917 0.0128462 -0.0460591 0.0163361 0.0461717 0.0915088 -0.0214896 0.0614395 -0.1246576 0.021103 -0.0446488 -0.009859 -0.0562207 -0.1771099 -0.0453574 0.005507 -0.0096875 0.0728645 -0.1257315 -0.1417307 -0.0010274 -0.0965542 0.0477798 0.0062723 -0.0302124 -0.0000786 0.0709298 0.0861156 -0.0129878 -0.0251674 -0.0283315 0.0785283 -0.0775695 -0.0448599 -0.0101746 -0.1394243 -0.0494528 0.1657512 0.0439913 0.135763 -0.0792691 -0.0196051 0.0616487 -0.0488047 0.0724211 -0.0987459 0.1091226 -0.0139003 0.1592236 0.0218358 0.0008705 0.0053498 -0.021572 0.0745854 0.0622511 0.0191969 0.0836644 0.0020442 0.1000154 0.0053703 0.0348401 -0.0443996 -0.1355684 0.0577284 -0.0717853 -0.0024112 -0.1050363 -0.1795796 0.0593563 0.015608 0.0878841 0.0651784 0.262539 -0.0805571 -0.0254911 -0.1142179 0.2059398 0.0676926 -0.1640572 0.1159705 0.0235317 0.2507564 0.0151333 -0.0851662 -0.0980623 -0.0139147 0.0115349 -0.1742216 -0.0437709 0.2498857 unknown
polarizability: 90.4116475|1.3911815|84.5575693|1.2695979|-1.2589414|69.3905796 unknown
InChI: InChI=1S/C6H16N2/c1-3-8(4-2)6-5-7/h3-7H2,1-2H3
charge 0 multiplicity 1
24 atoms
N  -0.494947 0.008118 0.104307
N  3.359457 0.011325 -0.070583
C  0.894407 0.333352 0.514784
C  -1.482664 1.056582 0.474594
C  -0.908633 -1.355754 0.533059
C  1.95897 -0.244689 -0.460675
C  -1.406845 2.298242 -0.434546
C  -2.00313 -1.965187 -0.364297
H  1.118512 -0.025889 1.553214
H  1.012756 1.433643 0.535335
H  -2.492588 0.616824 0.381628
H  -1.370703 1.363869 1.546296
H  -0.016538 -2.007623 0.488419
H  -1.24751 -1.360741 1.601277
H  1.781041 0.181906 -1.464209
H  1.822409 -1.338248 -0.559887
H  -0.42076 2.794013 -0.37345
H  -1.575577 2.007414 -1.485916
H  -2.173093 3.040605 -0.141937
H  -2.931702 -1.366115 -0.348082
H  -1.650599 -2.015533 -1.40909
H  -2.258458 -2.98655 -0.024406
H  3.640321 -0.432786 0.809382
H  3.631074 0.999026 -0.100019
