program: Gaussian 09
title: 000073071
version: EM64L-G09RevD.01
frameworkgroup: C1[X(C30H18O10)]
method: RPBEPBE
basis: SDD
operation: Freq
keyword: #p
keyword: freq=noraman
keyword: PBEPBE/SDD
title: #p freq=noraman PBEPBE/SDD
converged: YES YES NO NO
title: Mulliken charges:
elementType: O O O O O O O O O O C C C C C C C C C C C C C C C C C C C C C C C C C C C C C C H H H H H H H H H H H H H H H H H H
charge: -0.375502 -0.375503 -0.363264 -0.363265 -0.188121 -0.188120 -0.296550 -0.296560 -0.390870 -0.390868 -0.005025 -0.005030 0.239007 0.239003 0.146110 0.146118 0.370093 0.370102 -0.301444 -0.301437 0.009110 0.009085 0.244486 0.244486 0.005877 0.005892 0.154674 0.154675 -0.621323 -0.621325 -0.571933 -0.571939 0.157244 0.157246 0.517343 0.517340 -0.580123 -0.580114 -0.809804 -0.809804 0.255693 0.255693 0.293310 0.293310 0.267645 0.267645 0.380610 0.380610 0.231565 0.239911 0.237457 0.231565 0.239916 0.237452 0.366982 0.366982 0.386844 0.386843
chargesum: 0.00000
title: Mulliken charges with hydrogens summed into heavy atoms:
elementType: O O O O O O O O O O C C C C C C C C C C C C C C C C C C C C C C C C C C C C C C
charge: 0.005108 0.005107 0.003718 0.003718 -0.188121 -0.188120 -0.296550 -0.296560 -0.004025 -0.004025 -0.005025 -0.005030 0.239007 0.239003 0.146110 0.146118 0.370093 0.370102 -0.301444 -0.301437 0.009110 0.009085 0.244486 0.244486 0.005877 0.005892 0.154674 0.154675 -0.365630 -0.365632 -0.278623 -0.278628 0.157244 0.157246 0.517343 0.517340 -0.312478 -0.312469 -0.100872 -0.100871
polarizability: 5.86545562e+02 -1.66071421e-03 3.69712379e+02 -1.44370435e+01 3.98711531e-04 3.86150190e+02
1716.lowfreq: -12.0595 -8.4002 -0.0005 -0.0003 0.0003 2.2081 11.3538 21.3545 22.0669
frequency: 11.2094 21.2976 22.0014 34.3104 47.0702 50.6071 56.4241 56.7163 59.2408 86.7658 97.6433 111.5124 112.0987 134.3554 136.3941 158.6222 167.5052 168.6813 206.4804 210.1087 228.7975 229.3844 241.5404 242.2751 247.2625 252.9190 278.5937 283.8606 305.6778 306.4789 320.3354 322.9862 356.7572 357.7609 372.2167 376.0210 401.2464 403.4097 413.3832 415.9238 434.6188 436.1340 444.8451 447.7923 452.7386 457.2730 466.4306 470.0995 491.0353 512.8530 516.9244 532.2305 534.9520 542.0820 544.1926 545.2872 549.1655 573.1243 573.6987 591.5329 597.5816 616.7869 618.2509 628.0365 635.5688 637.8350 680.6622 692.4780 719.1040 729.3482 736.3961 744.6780 757.2549 758.4673 772.1064 828.9385 837.5086 839.2027 857.3829 859.5083 883.3426 887.4779 887.5155 896.9365 924.9343 925.7932 936.1248 936.1748 977.1718 977.2158 985.5202 988.2836 1011.4860 1016.0673 1016.6044 1050.8909 1050.9953 1089.5383 1102.2066 1105.9168 1113.1903 1150.3714 1156.3412 1164.2758 1165.3280 1175.1357 1187.0043 1198.7882 1221.6565 1234.7501 1237.0303 1260.7774 1278.4036 1291.7978 1314.3816 1319.2750 1326.5019 1328.5805 1361.7838 1366.7002 1381.6043 1388.8653 1398.0131 1398.8836 1406.1820 1406.2628 1410.8852 1422.7050 1431.1078 1433.2615 1454.0561 1460.8387 1462.4279 1468.1827 1468.1938 1469.9178 1475.7323 1475.7598 1532.2701 1535.3628 1549.0366 1549.3513 1562.9164 1564.2995 1575.5722 1577.4099 1616.7727 1619.2866 1635.5118 1638.0840 2638.9438 2639.0338 2982.9679 2982.9916 3061.8754 3061.8917 3095.5127 3095.5269 3147.3605 3147.3937 3153.2713 3153.2826 3160.8447 3160.8624 3474.0155 3479.1887 3530.0808 3530.1710
redmass: 6.4423 6.1393 7.9008 6.5407 4.7682 4.3501 1.1381 1.1722 8.4669 8.2817 7.6068 7.4766 7.3863 5.7620 5.6996 7.8128 5.8377 5.8491 6.3581 6.2845 4.7129 4.7401 5.1898 5.2100 4.4598 4.6193 6.6024 7.0537 5.5199 5.6409 5.7805 6.1729 5.5523 5.7194 6.9708 6.3142 5.7408 5.6357 5.9617 9.0505 1.3240 1.4340 6.8727 7.5378 9.5568 7.4141 4.7815 4.6466 1.1313 6.3914 7.4597 1.1366 9.7646 7.2116 4.1794 5.1375 5.2160 4.4512 4.5076 6.7537 6.2698 4.8832 4.8926 6.3665 4.9907 4.3190 5.3530 5.2203 4.7978 4.0495 5.7940 8.3527 7.4488 7.6935 8.3800 9.0026 3.3619 3.2901 1.8387 1.8641 6.3804 1.6501 1.6619 6.1647 7.4169 7.6487 1.5414 1.5261 1.0666 1.0665 2.3055 2.2290 6.2694 2.2460 2.2353 1.5842 1.5842 4.9778 3.5457 3.7060 3.9639 2.3972 1.7626 1.4431 1.2307 1.8353 1.8230 2.1248 1.7564 1.6152 1.6493 2.2367 2.2657 2.5638 6.6186 7.8537 6.5980 7.5291 5.0422 4.8889 4.6415 3.9327 1.4995 1.5442 2.5755 2.9094 7.9117 5.7699 7.7682 6.5796 3.7382 6.0136 5.6237 1.0457 1.0456 4.4464 1.1455 1.1513 8.2851 9.4584 3.7299 3.9043 4.0799 3.6646 5.5622 6.2450 6.2243 5.9979 6.2745 6.4713 1.0716 1.0716 1.0376 1.0376 1.0972 1.0972 1.0992 1.0992 1.0924 1.0923 1.0916 1.0916 1.0926 1.0926 1.0643 1.0649 1.0657 1.0657
irintensity: 0.0079 0.8803 0.1793 3.1474 2.3088 0.7023 0.0020 0.0784 1.1264 0.5845 0.4317 0.0426 0.0362 0.1697 0.0223 0.6644 1.6136 0.1896 0.5483 0.4014 0.1556 0.2668 0.1572 0.2358 8.1865 0.6698 3.6547 0.0001 8.0557 9.9937 31.3656 1.8465 0.5536 6.5304 19.1035 1.7854 3.8466 72.2179 1.9909 6.8264 94.5459 71.0241 14.1033 3.4506 6.9832 0.7775 28.8824 34.6388 55.4028 5.9031 13.1955 96.9483 7.1482 17.7129 0.0229 1.1979 17.9650 3.4520 1.2676 9.4609 45.0381 10.1328 4.2400 7.6184 4.8238 1.2840 24.1913 5.7826 20.8997 0.0052 8.0465 16.3597 2.3838 0.3101 15.4162 2.7474 14.1461 26.7212 21.3566 13.6908 25.0894 30.8274 28.6926 6.9386 8.5735 2.4644 0.9250 1.2550 109.0271 112.6557 2.1495 0.0676 115.9882 98.7763 1.0717 11.3483 18.1661 1.6550 173.0659 19.5184 105.0274 0.5423 54.7959 175.3009 194.2416 1.4560 223.0833 0.1558 233.1008 33.0042 51.7308 235.7503 790.4499 10.8995 124.5174 76.5346 686.4526 465.8236 317.4412 0.2094 61.8134 30.5667 8.4889 30.0949 70.2550 0.8876 63.7429 13.5116 13.4870 99.5910 12.7851 15.1713 116.2236 14.3129 15.7027 0.0563 153.4711 4.5967 61.2784 734.0512 15.2406 16.4905 100.0824 78.8466 88.8862 12.2512 105.3145 16.3918 260.0454 44.1792 231.9815 198.5959 24.1014 18.1538 15.1705 11.5569 30.8428 10.2893 4.5334 2.2834 0.7180 0.5676 10.1604 5.1450 0.5319 246.0127 78.1855 18.6931
temp: 298.150 k
press: 1.00000 atm
elementType: 8 8 8 8 8 8 8 8 8 8 6 6 6 6 6 6 6 6 6 6 6 6 6 6 6 6 6 6 6 6 6 6 6 6 6 6 6 6 6 6 1 1 1 1 1 1 1 1 1 1 1 1 1 1 1 1 1 1
symmnumber: 1
zpe: 1069080.0 jmol-1
zpe.correction: 0.407191 hartree
zpe.thermalcorrener: 0.440879 hartree
zpe.thermalcorrenthalpy: 0.441824 hartree
zpe.thermalcorrgfe: 0.340712 hartree
zpe.sumelectzpe: -1903.547906 hartree
zpe.sumelectthermal: -1903.514218 hartree
zpe.sumelectthermalent: -1903.513274 hartree
zpe.sumelectthermalfe: -1903.614386 hartree
dipole: 0.0002 -1.5564 0.0001
dipole: 1.5564
quadrupole: -267.7737 -202.4296 -203.7774
quadrupole: 0.0003 19.4329 -0.0001
quadrupole: -43.1135 22.2306 20.8828 0.0003 19.4329 -0.0001
hfenergy: -1903.9550973 hartree
pointgroup: C01 [X(C30H18O10)]
dipole: -0.0000618 -0.6123225 -0.0000277 debye
polarizability: 586.6631504|0.0017906|369.7123794|-13.5959668|-0.0000253|386.0326025 unknown
charge 0 multiplicity 1
58 atoms
O  0.648749 -3.22767 1.838262
O  -0.648741 -3.227652 -1.838254
O  -3.751738 -1.983172 3.27668
O  3.751747 -1.983161 -3.276668
O  -0.952682 0.139011 -1.739452
O  0.952706 0.13899 1.739491
O  -5.112362 -0.228147 1.865122
O  5.112379 -0.228107 -1.865097
O  -6.399407 1.526929 0.620885
O  6.399383 1.526931 -0.620915
C  -0.58322 -1.591568 0.474966
C  0.583235 -1.591567 -0.474945
C  -1.786257 -0.85092 0.305503
C  1.786273 -0.850922 -0.305479
C  -2.876948 -0.958517 1.242809
C  2.876966 -0.958517 -1.242785
C  -3.10079 0.926687 -1.006095
C  3.100799 0.926693 1.006118
C  -1.885342 0.081432 -0.872193
C  1.885356 0.08143 0.87222
C  -4.165356 0.794542 -0.067075
C  4.165359 0.794548 0.067095
C  -0.489108 -2.470088 1.600601
C  0.48912 -2.470077 -1.600587
C  -4.096607 -0.145865 1.057882
C  4.096632 -0.145876 -1.057843
C  -2.724595 -1.853169 2.352223
C  2.724608 -1.853159 -2.352207
C  -1.541213 -2.606333 2.513376
C  1.541223 -2.606318 -2.513365
C  -3.191053 1.839574 -2.073387
C  3.191068 1.839587 2.073404
C  -5.336006 1.609555 -0.238899
C  5.336002 1.609568 0.238894
C  -4.347442 2.654769 -2.239939
C  4.347453 2.654792 2.239936
C  -5.407954 2.528066 -1.320952
C  5.40796 2.528087 1.32094
C  -4.425458 3.640994 -3.388858
C  4.425463 3.641049 3.388828
H  -1.412361 -3.290664 3.359411
H  1.412367 -3.290641 -3.359406
H  -2.351418 1.906285 -2.772697
H  2.351441 1.906296 2.772723
H  -6.315013 3.13319 -1.415978
H  6.315018 3.133216 1.415952
H  1.350755 -3.007795 1.167654
H  -1.350745 -3.007781 -1.167644
H  -5.396702 4.161968 -3.415048
H  -3.630368 4.405682 -3.306743
H  -4.282577 3.131354 -4.359669
H  5.39682 4.161805 3.415188
H  3.630568 4.405919 3.306506
H  4.282262 3.131493 4.359633
H  -3.490401 -2.612019 3.998783
H  3.490404 -2.612001 -3.998775
H  -6.142314 0.802427 1.329471
H  6.142261 0.802438 -1.329497
