program: Gaussian 09
title: 000060977
version: EM64L-G09RevD.01
frameworkgroup: C1[X(C21H25NO2)]
method: RPBEPBE
basis: SDD
operation: Freq
keyword: #p
keyword: freq=noraman
keyword: PBEPBE/SDD
title: #p freq=noraman PBEPBE/SDD
converged: YES YES NO NO
title: Mulliken charges:
elementType: O O N C C C C C C C C C C C C C C C C C C C C C H H H H H H H H H H H H H H H H H H H H H H H H H
charge: -0.290965 -0.248604 -0.059924 0.252864 -0.542193 -0.501886 -0.386930 -0.384004 0.443146 -0.348324 -0.579090 -0.371077 -0.387047 0.312234 0.499729 -0.253316 -0.247090 -0.240114 -0.765596 -0.413625 -0.413448 -0.228694 -0.228215 -0.243723 0.253958 0.228164 0.231088 0.210826 0.208654 0.201281 0.197903 0.212632 0.195343 0.221555 0.212656 0.223017 0.238002 0.239144 0.225495 0.224780 0.228913 0.246875 0.245362 0.242719 0.231118 0.232973 0.223227 0.223216 0.226990
chargesum: 0.00000
title: Mulliken charges with hydrogens summed into heavy atoms:
elementType: O O N C C C C C C C C C C C C C C C C C C C C C
charge: -0.290965 -0.248604 -0.059924 0.252864 -0.060071 -0.059973 0.023005 0.026531 0.443146 0.068573 -0.143416 -0.133075 -0.147903 0.312234 0.499729 -0.027821 -0.022310 -0.011201 -0.030639 -0.182507 -0.180475 -0.005467 -0.004999 -0.016733
polarizability: 2.81553007e+02 2.56873902e+00 2.16033216e+02 -9.31778311e-01 -2.24123736e+01 1.97208173e+02
1716.lowfreq: -15.7296 -7.4575 -0.0007 -0.0004 0.0006 2.7042 16.4427 21.9779 30.8321
frequency: 15.8470 21.8602 29.7867 39.5654 57.3829 61.5021 64.7917 75.6488 82.3821 111.6913 118.9214 155.3490 175.6531 210.4073 233.0437 251.7193 271.0869 298.6296 313.4102 322.0300 344.2216 358.7458 379.7041 403.2521 403.8350 432.9776 470.7982 479.8653 507.0563 516.9685 540.6822 556.5178 575.7495 608.4064 616.7442 618.3524 673.0887 696.6105 702.3592 705.3207 748.6926 764.6938 767.3550 791.6590 817.3869 825.1265 829.3617 848.8700 853.3423 880.0764 913.2088 917.1445 933.7878 947.6089 974.7058 975.1565 989.9644 991.3969 992.2465 992.5692 995.1688 1000.2707 1013.4920 1024.2301 1026.2052 1027.4334 1037.4223 1040.0811 1049.4697 1084.5391 1087.4665 1099.1397 1121.2594 1132.1878 1162.2348 1171.9078 1173.6269 1180.5075 1187.0571 1187.7531 1195.9582 1201.8007 1217.1870 1221.5839 1256.8283 1283.3426 1284.6004 1301.9034 1313.5753 1317.0438 1326.0068 1327.4419 1338.4804 1344.5905 1369.2034 1379.3782 1380.2648 1383.1079 1393.3307 1435.3224 1441.1175 1452.7308 1455.3132 1457.1909 1462.4886 1473.0850 1477.4567 1480.5117 1483.7653 1487.8701 1488.7402 1590.9643 1593.2634 1612.9013 1614.5015 1641.7478 2847.7920 2851.2851 2864.0609 2996.6796 3002.7971 3014.8120 3017.9562 3020.1131 3032.9459 3039.8847 3061.9301 3081.7977 3092.4681 3096.2477 3113.3248 3113.9553 3122.6365 3130.6274 3131.2363 3137.7947 3142.1551 3144.5337 3157.5577 3161.3055 3170.1435
redmass: 4.2832 4.3535 4.1171 3.7526 2.7442 1.8478 1.9080 3.9011 4.6841 4.1126 4.1088 2.9455 4.1063 5.3876 2.9189 4.1598 3.3346 3.7295 3.3764 2.5737 2.7042 2.5526 2.4396 2.8008 2.8194 3.5534 3.2167 3.5197 3.0701 2.9054 3.7048 3.6818 3.4412 3.3997 6.3214 6.3657 3.8351 5.1282 1.6498 1.7665 2.2777 2.5277 2.3378 1.2130 1.6298 3.1965 3.1529 1.2654 1.2468 3.8453 1.8880 1.4924 2.4327 2.1195 1.3954 1.3878 6.0811 2.8736 2.1092 1.3500 1.6069 2.5004 1.6986 2.0855 2.2765 2.0080 2.4237 1.6807 2.4606 1.6939 1.7116 2.0967 2.7716 2.7146 1.6275 1.0593 1.0645 1.5240 1.1350 1.3017 1.3102 2.3915 2.2077 2.2635 1.4225 1.2425 1.4829 1.4674 1.8163 1.3821 1.3247 1.3124 1.3340 1.3455 1.3773 1.2540 6.8590 7.0739 1.4017 2.2024 2.1829 1.0593 1.0558 1.0926 1.0895 1.0832 1.1477 1.3063 2.1565 1.4159 1.2221 5.9920 6.0628 6.0409 6.1835 9.7710 1.0704 1.0717 1.0695 1.0605 1.0379 1.0664 1.0674 1.0834 1.0830 1.0856 1.1025 1.1023 1.0987 1.0946 1.0870 1.0869 1.0845 1.0907 1.0879 1.1022 1.0958 1.0934 1.0966 1.1014 1.0982
irintensity: 0.0304 0.0101 0.0499 0.1183 0.9744 0.2537 0.2999 0.1215 4.5835 2.4022 1.1399 0.8815 0.4341 2.4335 0.9479 3.0866 5.6888 1.9221 5.0294 0.8879 2.7066 0.6530 1.6404 0.1222 0.0036 1.8472 0.7863 4.5467 20.1324 6.8365 8.5907 5.6342 11.0826 8.5841 0.0170 0.0577 1.8580 10.1534 53.1520 52.4567 16.4983 27.6174 55.6325 1.9218 0.5230 10.7716 4.0760 0.2734 0.0222 46.2351 49.5777 3.1915 24.7287 12.2282 0.4608 0.0453 1.9909 30.0507 60.3306 1.5986 0.7508 42.2290 5.5754 6.5670 10.9748 7.3995 37.4373 5.1986 5.0826 5.0034 12.2525 25.9845 21.8383 17.6172 7.4576 0.3990 0.4614 12.9774 3.3796 35.1738 64.4176 279.1373 8.0383 2.3702 12.1149 1.1325 0.7945 27.9067 34.7773 6.5675 0.0819 0.1707 22.9252 11.1077 6.3185 51.1407 1.5426 0.2948 3.5676 8.3294 6.9649 18.8730 14.6369 22.4987 2.6566 4.3076 3.7106 24.6912 25.6041 10.1060 2.2988 1.6307 1.5507 0.6647 12.0658 145.7554 38.7556 31.1046 164.1648 24.0527 3.8397 3.2704 11.6605 17.4921 56.1464 49.0975 28.4431 28.9635 13.3122 10.3695 10.5459 8.1740 1.4430 10.8722 3.6534 10.1864 45.0593 29.5734 38.7406 26.1615 7.9107
temp: 298.150 k
press: 1.00000 atm
elementType: 8 8 7 6 6 6 6 6 6 6 6 6 6 6 6 6 6 6 6 6 6 6 6 6 1 1 1 1 1 1 1 1 1 1 1 1 1 1 1 1 1 1 1 1 1 1 1 1 1
symmnumber: 1
zpe: 1077167.9 jmol-1
zpe.correction: 0.410272 hartree
zpe.thermalcorrener: 0.432835 hartree
zpe.thermalcorrenthalpy: 0.433779 hartree
zpe.thermalcorrgfe: 0.355205 hartree
zpe.sumelectzpe: -1018.663321 hartree
zpe.sumelectthermal: -1018.640757 hartree
zpe.sumelectthermalent: -1018.639813 hartree
zpe.sumelectthermalfe: -1018.718387 hartree
dipole: 0.1844 0.5387 1.6852
dipole: 1.7788
quadrupole: -138.9895 -136.1959 -140.3500
quadrupole: 2.5411 -8.0469 -5.4183
quadrupole: -0.4777 2.3159 -1.8382 2.5411 -8.0469 -5.4183
hfenergy: -1019.0735921 hartree
pointgroup: C01 [X(C21H25N1O2)]
dipole: -0.0627839 -0.1854817 0.67186 debye
polarizability: 281.4903644|3.5513698|217.8946324|-0.4028014|21.5382624|195.4093987 unknown
InChI: InChI=1S/C21H25NO2/c1-18(23)24-21(20-10-6-3-7-11-20)13-16-22(17-14-21)15-12-19-8-4-2-5-9-19/h2-11H,12-17H2,1H3
charge 0 multiplicity 1
49 atoms
O  3.28097 1.749027 0.285705
O  4.12418 1.229844 -1.842358
N  -0.832642 0.697219 0.391784
C  2.143711 0.722949 0.196427
C  1.220185 1.081315 -0.99211
C  1.366382 1.002515 1.50648
C  -0.160593 0.393317 -0.895099
C  0.01401 0.264944 1.53263
C  2.78133 -0.677149 0.167623
C  -2.208229 0.150542 0.468108
C  -3.221717 0.946644 -0.399229
C  2.614943 -1.577564 -0.912945
C  3.598543 -1.081138 1.257406
C  4.197534 1.861092 -0.764027
C  -4.633846 0.402192 -0.24604
C  3.225181 -2.85129 -0.896674
C  4.215996 -2.34935 1.275075
C  4.025228 -3.246159 0.198412
C  5.294433 2.83797 -0.387335
C  -5.096868 -0.658256 -1.067814
C  -5.504643 0.908882 0.753463
C  -6.392044 -1.197666 -0.898425
C  -6.801025 0.373578 0.927567
C  -7.249512 -0.683598 0.101832
H  1.700824 0.844474 -1.954728
H  1.061052 2.175077 -0.959953
H  1.17966 2.089853 1.562117
H  1.967877 0.715602 2.38606
H  -0.787807 0.763993 -1.725176
H  -0.052818 -0.713057 -1.033736
H  0.186167 -0.842209 1.528428
H  -0.513673 0.511983 2.472208
H  -2.246929 -0.930518 0.175949
H  -2.538222 0.205648 1.52299
H  -2.916969 0.900442 -1.461702
H  -3.168911 2.006405 -0.089396
H  2.029709 -1.283509 -1.788458
H  3.771574 -0.389984 2.089855
H  3.084741 -3.529962 -1.745461
H  4.846492 -2.636914 2.12412
H  4.501082 -4.23314 0.209182
H  6.037921 2.322966 0.248639
H  4.888146 3.683622 0.19008
H  5.79896 3.197272 -1.2967
H  -4.439598 -1.057907 -1.850688
H  -5.165246 1.733357 1.393409
H  -6.733475 -2.013485 -1.546016
H  -7.461458 0.78234 1.70105
H  -8.255509 -1.097911 0.233065
