program: Orca
programVersion: 5.0.2
elementType: O O O O O N N N N N N N N C C C C C C C C C C C C C C C C C H H H H H H H H H H H H H H H H H H H H H H H H H H H
charge: 1
multiplicity: 1
keywords: wb97x-d3
keywords: def2-TZVPP
keywords: def2/J RIJCOSX
keywords: DEFGRID2
keywords: scfconv7
keywords: smallprint printgap noloewdin
keywords: NOSOSCF
formula: C17H27N8O5
InChI: InChI=1/C17H27N8O5/c1-24(16(20)21)6-4-9(18)8-12(26)22-10-2-3-13(30-14(10)15(27)28)25-7-5-11(19)23-17(25)29/h2-3,5,7,9-10,13-14,22,27H,4,6,8,18-21H2,1H3
57 atoms
O  -1.973951 -0.165584 -0.615501
O  1.596295 1.41256 2.683701
O  1.272112 -0.235708 -1.837418
O  0.028223 -1.869079 -0.945652
O  -5.180357 0.308887 -2.007454
N  0.957784 1.695421 0.539647
N  -4.165684 -0.009777 0.003218
N  5.167458 2.046159 -0.279046
N  4.5871 -1.530754 -0.347639
N  -6.246223 -0.995989 -0.508762
N  5.230826 -0.156614 -2.102127
N  3.784521 -1.914101 -2.476992
N  -7.283422 -2.336087 1.012743
C  -0.282509 0.965634 0.652471
C  -0.696208 0.407629 -0.720011
C  4.027668 1.437601 0.394792
C  -3.005915 0.766922 -0.382087
C  3.151301 2.449645 1.15828
C  -1.401709 1.834602 1.157868
C  4.519594 0.326033 1.315083
C  -2.634058 1.756498 0.676771
C  1.834865 1.824348 1.552388
C  5.344462 -0.754455 0.629561
C  0.230616 -0.703706 -1.177304
C  -4.147567 -0.642894 1.206654
C  -5.218835 -0.220878 -0.899007
C  3.699874 -2.565515 0.166522
C  4.547791 -1.192634 -1.629985
C  -5.15769 -1.43887 1.593925
C  -6.241726 -1.583673 0.674192
H  -0.127521 0.130345 1.342382
H  -0.684186 1.222843 -1.457514
H  3.398012 1.004768 -0.387812
H  -3.260911 1.29523 -1.304876
H  2.968224 3.309176 0.50816
H  3.669841 2.805691 2.049713
H  -1.156485 2.556521 1.927609
H  3.672764 -0.143572 1.82011
H  5.141137 0.764579 2.102149
H  1.182641 2.122308 -0.347883
H  -3.414562 2.427346 1.014454
H  5.705998 -1.457639 1.378999
H  6.235194 -0.343591 0.156933
H  4.862641 2.852738 -0.811885
H  5.835609 2.384246 0.405761
H  -3.286044 -0.4694 1.837132
H  2.655826 -2.360618 -0.067458
H  3.965445 -3.551763 -0.216145
H  3.796803 -2.598403 1.247058
H  -5.145505 -1.936814 2.551727
H  5.44651 0.651179 -1.491412
H  5.144267 0.045564 -3.08682
H  3.586269 -2.879451 -2.256171
H  -8.058292 -2.449976 0.380091
H  -7.31681 -2.804571 1.902645
H  1.902637 -0.945288 -2.074227
H  3.902436 -1.739023 -3.465231
elementType: O N C H
totalener: -1478.36509750 hartree
nucrepener: 3122.28232562 hartree
electener: -4600.64742312 hartree
oneelecener: -8200.42421448 hartree
twoeener: 3599.77679136 hartree
cpcmener: -0.19546817 hartree
kineticenergy: 1471.98039883 hartree
xcener: -138.922859032327 hartree
chargesum: 1.0000000
charge: -0.366176 -0.566153 -0.319172 -0.458690 -0.574562 -0.198025 -0.090272 -0.342673 -0.090959 -0.407193 -0.272145 -0.258026 -0.216046 0.185996 0.130064 0.118033 0.260502 -0.144211 -0.216078 -0.150728 -0.230439 0.329212 -0.075891 0.383842 0.058216 0.350941 -0.180687 0.366027 -0.291547 0.292935 0.098075 0.127183 0.080249 0.124721 0.112388 0.092898 0.148472 0.083104 0.096309 0.177032 0.145284 0.118898 0.109418 0.146838 0.142521 0.169365 0.123709 0.129996 0.110563 0.162921 0.210147 0.187374 0.210079 0.190982 0.200644 0.274693 0.200042
qa: -0.3662 -0.5662 -0.3192 -0.4587 -0.5746 -0.1980 -0.0903 -0.3427 -0.0910 -0.4072 -0.2721 -0.2580 -0.2160 0.1860 0.1301 0.1180 0.2605 -0.1442 -0.2161 -0.1507 -0.2304 0.3292 -0.0759 0.3838 0.0582 0.3509 -0.1807 0.3660 -0.2915 0.2929 0.0981 0.1272 0.0802 0.1247 0.1124 0.0929 0.1485 0.0831 0.0963 0.1770 0.1453 0.1189 0.1094 0.1468 0.1425 0.1694 0.1237 0.1300 0.1106 0.1629 0.2101 0.1874 0.2101 0.1910 0.2006 0.2747 0.2000
va: 1.9972 1.9191 2.2015 2.0338 1.9095 3.1958 3.1522 3.0944 3.2593 2.9709 3.2643 3.2834 3.3006 3.6868 3.9531 3.7827 3.9187 3.8975 3.9431 3.8134 3.8617 4.1047 3.8707 4.2083 3.9792 4.4528 3.8711 4.1447 3.8879 4.1755 1.0424 1.0131 1.0341 1.0281 1.0198 1.0314 1.0100 1.0327 1.0180 1.0128 1.0069 0.9993 1.0175 1.0211 1.0208 0.9933 1.0021 0.9891 1.0013 0.9976 1.0861 1.0062 0.9938 1.0101 0.9954 1.0216 1.0005
dispersion: -0.033468357 hartree
energy: -1478.398565857263 hartree
dipole: 39.01317 -29.18153 9.83164 1.17822 -1.82820 -0.64998 4.66697 -5.24725 -0.58028
magnitude: 9.87017 au
magnitude: 25.08798 debye
