program: Orca
programVersion: 5.0.2
elementType: O O O O O N N N N N N N N C C C C C C C C C C C C C C C C C H H H H H H H H H H H H H H H H H H H H H H H H H H H
charge: 1
multiplicity: 1
keywords: wb97x-d3
keywords: def2-TZVPP
keywords: def2/J RIJCOSX
keywords: DEFGRID2
keywords: scfconv7
keywords: smallprint printgap noloewdin
keywords: NOSOSCF
formula: C17H27N8O5
InChI: InChI=1/C17H24N7O5.H3N/c1-23(16(19)20)6-4-9-8-12(25)21-10-2-3-13(29-14(10)15(26)28-9)24-7-5-11(18)22-17(24)27;/h2-3,5,7,9-10,13-14,21H,4,6,8,18-20H2,1H3;1H3
57 atoms
O  0.658066 -0.642064 -0.014167
O  -2.969954 -2.293819 2.171299
O  -1.763107 0.413054 0.778552
O  -2.733002 -0.831626 -0.836741
O  3.03925 0.596819 -1.797365
N  -1.852209 -3.253349 0.443631
N  2.950761 -0.695288 0.069074
N  7.023207 2.916437 -0.755082
N  -3.817463 2.313445 0.280078
N  4.593895 0.987672 -0.195777
N  -2.90183 2.419543 -1.853904
N  -1.727906 3.224005 -0.061816
N  6.107293 1.386706 1.448612
C  -0.603387 -2.554304 0.676755
C  -0.510997 -1.338748 -0.274078
C  -4.083582 -1.077657 -0.40501
C  1.797598 -1.362154 -0.451414
C  -4.164177 -2.53035 0.130961
C  0.634458 -3.368931 0.455059
C  -4.705838 -0.05106 0.535744
C  1.729843 -2.810628 -0.0491
C  -2.975044 -2.731849 1.046002
C  -4.874806 1.360173 -0.045531
C  -1.717283 -0.463228 -0.032549
C  3.364691 -0.916213 1.34451
C  3.528993 0.350303 -0.715544
C  -3.759659 2.727028 1.675223
C  -2.821681 2.623291 -0.537861
C  4.40076 -0.242939 1.868504
C  5.040207 0.724856 1.015027
H  -0.626091 -2.197262 1.709676
H  -0.544785 -1.707142 -1.311947
H  -4.647805 -1.044265 -1.340285
H  1.871907 -1.29632 -1.543626
H  -4.163799 -3.225219 -0.711118
H  -5.095987 -2.674188 0.677198
H  0.611654 -4.417665 0.725725
H  -4.223257 -0.036577 1.512462
H  -5.716612 -0.423252 0.721096
H  -1.976368 -3.581614 -0.502774
H  2.6180 -3.402962 -0.234936
H  -5.796629 1.792993 0.34386
H  -5.025984 1.301144 -1.123218
H  6.995082 3.922964 -0.835549
H  7.816941 2.592392 -1.289809
H  2.82728 -1.669229 1.906149
H  -3.129903 2.066398 2.271902
H  -3.400537 3.751116 1.756848
H  -4.765655 2.701195 2.08604
H  4.737213 -0.43545 2.876152
H  -3.769517 2.226436 -2.318409
H  -2.081399 2.462365 -2.432676
H  -1.026679 3.561278 -0.699723
H  6.591981 2.031952 0.800086
H  6.499451 1.189603 2.350337
H  -1.386592 2.979302 0.853947
H  6.187005 2.54452 -1.19267
totalener: -1478.19687130 hartree
nucrepener: 3196.79628888 hartree
electener: -4674.99316018 hartree
oneelecener: -8350.97187796 hartree
twoeener: 3675.97871777 hartree
kineticenergy: 1472.10099498 hartree
xcener: -138.919767712284 hartree
chargesum: 1.0000000
charge: -0.301113 -0.337431 -0.360573 -0.299194 -0.418978 -0.180841 -0.115070 -0.385594 -0.049586 -0.398107 -0.212935 -0.205807 -0.272230 0.162373 0.099296 0.155441 0.176461 -0.181869 -0.244574 -0.151562 -0.177564 0.207641 -0.169206 0.367358 0.024593 0.306691 -0.206487 0.341722 -0.240102 0.343075 0.123916 0.095987 0.100549 0.115612 0.107609 0.107392 0.136514 0.136183 0.100661 0.131033 0.145217 0.142757 0.096033 0.139563 0.143950 0.133003 0.139192 0.132673 0.115776 0.116699 0.181559 0.177381 0.162969 0.219145 0.149148 0.207544 0.166107
qa: -0.3011 -0.3374 -0.3606 -0.2992 -0.4190 -0.1808 -0.1151 -0.3856 -0.0496 -0.3981 -0.2129 -0.2058 -0.2722 0.1624 0.0993 0.1554 0.1765 -0.1819 -0.2446 -0.1516 -0.1776 0.2076 -0.1692 0.3674 0.0246 0.3067 -0.2065 0.3417 -0.2401 0.3431 0.1239 0.0960 0.1005 0.1156 0.1076 0.1074 0.1365 0.1362 0.1007 0.1310 0.1452 0.1428 0.0960 0.1396 0.1440 0.1330 0.1392 0.1327 0.1158 0.1167 0.1816 0.1774 0.1630 0.2191 0.1491 0.2075 0.1661
va: 2.0519 2.1567 2.1384 2.0929 2.0893 3.1782 3.1934 3.0843 3.2484 2.9677 3.3192 3.3267 3.2135 3.7331 4.0286 3.8571 4.0026 3.8803 3.9768 3.7723 3.8050 4.2854 3.9009 4.0728 4.0629 4.4668 3.8677 4.2224 3.9481 4.0668 1.0383 1.0268 0.9946 1.0235 1.0154 1.0291 1.0149 1.0210 1.0181 1.0404 1.0071 0.9968 1.0120 1.0264 1.0236 1.0044 0.9910 0.9974 0.9998 1.0137 1.0217 1.0198 1.0298 1.0696 1.0292 1.0022 1.0288
dispersion: -0.032988180 hartree
energy: -1478.229859484348 hartree
dipole: -7.41400 3.63036 -3.78364 11.16166 -9.11792 2.04374 0.17147 -1.01933 -0.84786
magnitude: 4.38311 au
magnitude: 11.14097 debye
