program: Gaussian 09
title: 000060968
version: EM64L-G09RevD.01
frameworkgroup: C1[X(C15H26O2)]
method: RPBEPBE
basis: SDD
operation: Freq
keyword: #pfreq=noraman
keyword: PBEPBE/SDD
title: #p freq=noraman PBEPBE/SDD
converged: NO YES NO NO
title: Mulliken charges:
elementType: O O C C C C C C C C C C C C C C C H H H H H H H H H H H H H H H H H H H H H H H H H H
charge: -0.292949 -0.246731 0.301114 0.349475 -0.204663 -0.101815 -0.549435 -0.516707 -0.484444 -0.824816 -0.784546 -0.791460 0.258605 -0.518045 -0.053110 -0.693835 -0.695025 0.241782 0.275965 0.241349 0.226675 0.258208 0.207661 0.230975 0.204817 0.218307 0.212755 0.229703 0.213507 0.238536 0.214302 0.213134 0.212371 0.236959 0.234026 0.223105 0.207368 0.247532 0.203571 0.209182 0.216797 0.217385 0.212417
chargesum: 0.00000
title: Mulliken charges with hydrogens summed into heavy atoms:
elementType: O O C C C C C C C C C C C C C C C
charge: -0.292949 -0.246731 0.301114 0.349475 0.037119 0.174151 -0.081411 -0.050838 -0.048652 -0.164052 -0.118202 -0.128995 0.258605 -0.060914 0.154257 -0.033551 -0.048426
polarizability: 1.92508655e+02 -8.83169930e-01 1.48406264e+02 3.85505995e-01 1.76123160e+00 1.44489079e+02
1716.lowfreq: -24.6588 -15.2586 0.0001 0.0004 0.0004 10.7675 13.4057 35.5827 40.7722
frequency: -8.9803 35.2233 40.1869 57.4140 77.4226 141.7824 153.3096 180.5148 194.1548 206.3384 213.2735 217.3011 230.1854 234.2716 238.0375 256.3172 310.1961 319.4655 349.9601 356.4712 364.4345 390.7485 413.2326 452.8701 456.2380 497.2253 505.0845 565.8448 580.5923 594.7219 634.7690 716.8233 741.1173 775.8895 792.5472 804.4491 830.0171 867.2103 879.3199 898.8841 910.4509 924.8379 933.7857 939.0213 945.3462 955.6126 960.4195 965.7973 977.2299 989.8669 1008.2082 1036.5346 1045.6000 1064.1943 1078.0560 1103.6308 1107.5113 1133.7245 1150.5288 1157.1209 1169.1510 1189.7000 1197.8570 1203.5836 1219.7313 1226.0244 1243.8575 1246.4437 1263.6473 1270.0041 1271.7995 1294.7559 1299.7932 1319.1112 1327.6890 1347.9541 1360.0965 1380.4456 1381.6223 1385.1236 1398.6710 1399.9908 1447.7165 1458.6576 1462.8559 1463.8417 1469.2441 1471.1851 1473.0762 1478.1480 1482.9204 1484.7492 1485.2003 1487.5332 1498.1118 1501.8588 1625.3864 2969.8018 2970.7783 2973.1865 2975.0505 2979.2758 2979.9513 3002.0968 3011.6289 3016.3877 3017.3277 3039.5768 3049.0803 3053.4406 3055.6388 3059.5077 3061.4281 3066.7092 3067.2242 3069.7458 3076.5821 3077.3557 3082.8512 3086.5348 3087.4126 3088.3120 3094.6725
redmass: 3.0994 5.4043 3.2060 3.5642 2.7537 1.2766 3.3055 1.9328 1.1231 1.7150 1.1583 1.7164 2.5684 1.6719 1.7332 2.0956 3.3118 2.2610 2.2021 2.1586 2.3288 2.3132 2.0049 2.9659 2.5704 3.0007 2.8246 4.2215 3.5431 4.5083 3.3927 3.6276 2.7294 3.3168 3.1700 1.7437 2.1011 2.4040 2.6594 1.6341 2.2403 1.2800 1.8207 1.6067 1.5524 1.8308 1.9386 1.6552 2.4019 1.6120 2.2800 1.6875 2.0898 1.9658 1.2588 1.4785 1.4854 2.2363 2.1326 1.9380 2.3728 2.1799 1.8847 1.6485 1.8125 1.8054 1.2975 1.7267 1.6489 1.6145 1.8220 1.5544 1.5957 2.0908 1.5168 1.2950 1.3529 1.2071 1.2127 1.2380 1.1943 1.2149 1.1008 1.0664 1.0570 1.0455 1.0569 1.0518 1.0664 1.0559 1.0475 1.0547 1.0561 1.0678 1.0710 1.0688 9.7060 1.0793 1.0361 1.0366 1.0376 1.0377 1.0382 1.0601 1.0607 1.0619 1.0655 1.0863 1.0900 1.0991 1.1020 1.0979 1.0978 1.0993 1.0985 1.1000 1.1000 1.1018 1.1021 1.1008 1.0993 1.0971 1.0965
irintensity: 0.1216 1.4153 0.5604 0.4028 0.1019 0.7532 0.9666 0.7915 0.7065 1.0181 0.0840 0.4377 1.4734 2.9202 2.2902 0.7461 1.1216 1.7413 0.2371 0.3189 0.6328 1.1029 0.0427 2.3205 0.1908 2.0579 3.5414 3.5468 0.3592 3.6823 1.0441 2.7078 8.1267 0.6344 1.5151 7.1597 0.5533 6.8846 13.5715 1.8653 2.1084 4.2623 5.4959 2.9690 7.1142 4.7875 2.4550 2.5809 98.1008 7.5141 26.4773 2.0635 18.0326 131.1670 4.0638 12.4116 13.5951 5.1766 8.4875 21.8576 164.2639 39.8831 6.6629 1.3253 2.9884 1.2574 31.0180 0.0588 0.7904 47.8030 20.8308 2.7804 3.9388 1.6362 1.0375 15.2001 9.5595 16.6503 17.5937 15.7022 26.8968 16.2714 8.4635 0.0340 7.1366 0.9767 8.9245 4.8506 18.1583 3.1042 22.3141 9.3441 14.1273 6.5948 18.9412 9.1272 156.1368 23.3694 26.3587 33.4072 20.7684 66.0162 23.6346 34.4528 21.4139 20.4000 54.4291 11.5990 32.7188 2.6265 21.2213 67.8542 34.8064 48.2168 17.9420 19.7900 58.2815 16.0056 24.2561 67.4441 31.4254 52.8710 22.7976
temp: 298.150 k
press: 1.00000 atm
elementType: 8 8 6 6 6 6 6 6 6 6 6 6 6 6 6 6 6 1 1 1 1 1 1 1 1 1 1 1 1 1 1 1 1 1 1 1 1 1 1 1 1 1 1
symmnumber: 1
zpe: 996850.7 jmol-1
zpe.correction: 0.379680 hartree
zpe.thermalcorrener: 0.397772 hartree
zpe.thermalcorrenthalpy: 0.398716 hartree
zpe.thermalcorrgfe: 0.334605 hartree
zpe.sumelectzpe: -736.286556 hartree
zpe.sumelectthermal: -736.268464 hartree
zpe.sumelectthermalent: -736.267520 hartree
zpe.sumelectthermalfe: -736.331631 hartree
dipole: -0.7851 1.3520 1.1252
dipole: 1.9262
quadrupole: -99.1406 -108.7786 -106.5598
quadrupole: 3.9801 5.3022 -3.4106
quadrupole: 5.6858 -3.9523 -1.7335 3.9801 5.3022 -3.4106
hfenergy: -736.666236 hartree
pointgroup: C01 [X(C15H26O2)]
dipole: 0.3017869 0.6272791 -0.2996043 debye
polarizability: 192.5090751|0.9105476|149.0220564|-0.1795355|-0.5978272|143.8728666 unknown
InChI: InChI=1S/C15H26O2/c1-10(2)8-13(16)17-12-9-11-6-7-15(12,5)14(11,3)4/h10-12H,6-9H2,1-5H3
charge 0 multiplicity 1
43 atoms
O  -0.746551 -0.085392 -0.695897
O  -1.929325 -1.748293 0.434445
C  1.743149 -0.020078 -0.816106
C  2.860138 -0.123581 0.313214
C  2.055327 0.785764 1.315995
C  0.508527 -0.541282 -0.023193
C  1.572351 1.530793 -0.961452
C  0.682842 0.054538 1.41145
C  1.82261 2.083809 0.487069
C  1.989564 -0.753682 -2.137024
C  3.124376 -1.558424 0.838001
C  4.228563 0.460532 -0.111253
C  -1.913304 -0.79142 -0.377955
C  -3.111816 -0.232011 -1.123347
C  -4.094014 0.570701 -0.205013
C  -4.809358 -0.337763 0.821316
C  -3.388772 1.760324 0.487662
H  2.541465 0.953351 2.292382
H  0.465297 -1.644235 -0.00435
H  0.56702 1.776498 -1.340154
H  2.304755 1.929073 -1.68643
H  0.669785 -0.739878 2.176009
H  -0.136376 0.755967 1.649648
H  2.701936 2.751382 0.523318
H  0.960217 2.657331 0.871807
H  2.904735 -0.382238 -2.634146
H  2.099651 -1.844704 -1.987542
H  1.143964 -0.596875 -2.832006
H  3.871128 -1.528925 1.653923
H  2.227951 -2.064662 1.232567
H  3.541968 -2.194289 0.034442
H  4.896984 0.533367 0.767777
H  4.722427 -0.203065 -0.845996
H  4.158244 1.463951 -0.561499
H  -2.752374 0.419087 -1.938321
H  -3.661465 -1.084359 -1.564582
H  -4.862339 0.983336 -0.891868
H  -4.083562 -0.816053 1.502092
H  -5.52171 0.25205 1.4278
H  -5.37453 -1.144314 0.318358
H  -2.65276 1.406143 1.234104
H  -2.852684 2.395758 -0.241072
H  -4.126134 2.389967 1.018625
