program: Orca
programVersion: 5.0.2
elementType: O O O O O O O O O N N N C C C C C C C C C C C C C C H H H H H H H H H H H H H H H H H H H H H H H H H H
charge: 1
multiplicity: 1
keywords: wb97x-d3
keywords: def2-TZVPP
keywords: def2/J RIJCOSX
keywords: DEFGRID2
keywords: scfconv7
keywords: smallprint printgap noloewdin
keywords: NOSOSCF
formula: C14H26N3O9
InChI: InChI=1/C14H26N3O9/c1-3-5(17-12(16)13(23)24)2-4(15)14(25-3)26-11-9(21)7(19)6(18)8(20)10(11)22/h3-11,14,17-23H,2,15-16H2,1H3
52 atoms
O  0.739355 -0.152773 0.278625
O  -1.033684 -0.830377 1.556134
O  2.158433 0.9164 2.493376
O  2.209658 -1.734806 -1.498821
O  4.507293 -0.535105 2.23795
O  4.866906 -1.029554 -1.921379
O  6.307362 0.14692 0.241794
O  -6.795425 1.671069 -1.685036
O  -5.427307 3.075219 -0.575919
N  -1.879874 -2.582828 -0.664659
N  -3.719077 1.043937 -0.131572
N  -5.099298 -0.353301 -1.343144
C  2.122259 -0.424456 0.47134
C  2.725456 0.76049 1.219985
C  2.811771 -0.634166 -0.865241
C  4.227307 0.576541 1.420431
C  4.301686 -0.855905 -0.647806
C  4.926201 0.330553 0.088196
C  -0.17272 -1.174376 0.491491
C  -0.977509 -1.437193 -0.785215
C  -1.810543 -0.195003 -1.08869
C  -2.714955 0.019686 0.120084
C  -1.866028 0.296289 1.365323
C  -2.682898 0.469929 2.62905
C  -4.793953 0.813601 -0.824248
C  -5.718796 2.006622 -1.012716
H  2.243602 -1.327464 1.084317
H  2.578431 1.664007 0.605758
H  2.687113 0.278358 -1.472604
H  4.630489 1.499147 1.861596
H  4.430032 -1.762633 -0.035209
H  4.803584 1.224316 -0.534502
H  0.324006 -2.095392 0.816677
H  -0.263128 -1.60613 -1.590453
H  -2.380267 -0.360333 -2.005717
H  -1.178794 0.68092 -1.252348
H  -3.261966 -0.906732 0.327732
H  -1.263343 1.200487 1.191605
H  1.202603 0.852313 2.419703
H  2.766558 -1.980763 -2.245384
H  4.146607 -0.371495 3.114091
H  5.823198 -1.081339 -1.825103
H  6.449153 -0.441276 0.991976
H  -3.328731 -0.390303 2.807825
H  -2.025563 0.577971 3.490428
H  -3.305678 1.364155 2.589452
H  -1.929976 -2.928238 0.284953
H  -1.562737 -3.352191 -1.236019
H  -5.963282 -0.477584 -1.847511
H  -4.477115 -1.151993 -1.283155
H  -7.388493 2.429538 -1.805699
H  -3.577847 1.999557 0.17836
totalener: -1390.40648914 hartree
nucrepener: 2673.44206913 hartree
electener: -4063.84855827 hartree
oneelecener: -7196.95606917 hartree
twoeener: 3133.10751089 hartree
kineticenergy: 1384.69655811 hartree
xcener: -127.523266302734 hartree
chargesum: 1.0000000
charge: -0.374021 -0.321858 -0.351888 -0.353176 -0.360952 -0.353963 -0.354965 -0.250544 -0.270811 -0.409385 -0.112068 -0.160646 0.088320 0.032247 0.112393 0.095512 0.035197 0.117054 0.259040 0.130056 -0.176040 -0.005676 0.032258 -0.244022 0.263661 0.368658 0.086471 0.078806 0.072060 0.118664 0.093700 0.085986 0.113417 0.114626 0.095023 0.124403 0.097651 0.095398 0.191449 0.194253 0.193124 0.200547 0.198461 0.095279 0.117988 0.072900 0.141820 0.140469 0.200699 0.201307 0.249830 0.191291
qa: -0.3740 -0.3219 -0.3519 -0.3532 -0.3610 -0.3540 -0.3550 -0.2505 -0.2708 -0.4094 -0.1121 -0.1606 0.0883 0.0322 0.1124 0.0955 0.0352 0.1171 0.2590 0.1301 -0.1760 -0.0057 0.0323 -0.2440 0.2637 0.3687 0.0865 0.0788 0.0721 0.1187 0.0937 0.0860 0.1134 0.1146 0.0950 0.1244 0.0977 0.0954 0.1914 0.1943 0.1931 0.2005 0.1985 0.0953 0.1180 0.0729 0.1418 0.1405 0.2007 0.2013 0.2498 0.1913
va: 1.9936 2.0386 2.0870 2.0807 2.0955 2.0710 2.0808 2.2621 2.2067 3.0435 3.4854 3.4347 3.7789 4.1575 3.8956 3.9227 3.9963 3.9495 4.0514 3.8565 3.7480 3.7045 3.9280 3.9395 4.0341 4.2657 1.0507 1.0148 1.0296 0.9959 1.0286 1.0165 1.0150 1.0580 1.0359 1.0406 1.0430 0.9998 1.0638 1.0504 1.0502 1.0490 1.0443 1.0075 1.0113 1.0124 1.0344 1.0269 1.0130 1.0351 1.0094 1.0242
dispersion: -0.029703894 hartree
energy: -1390.436193031202 hartree
dipole: 1.80876 -8.50339 -6.69463 -5.92549 6.15780 0.23232 2.81761 -4.10642 -1.28881
magnitude: 6.82152 au
magnitude: 17.33892 debye
