program: Orca
programVersion: 5.0.2
elementType: O O O O O O O O O N N N C C C C C C C C C C C C C C H H H H H H H H H H H H H H H H H H H H H H H H H H
charge: 1
multiplicity: 1
keywords: wb97x-d3
keywords: def2-TZVPP
keywords: def2/J RIJCOSX
keywords: DEFGRID2
keywords: scfconv7
keywords: smallprint printgap noloewdin
keywords: NOSOSCF
formula: C14H26N3O9
InChI: InChI=1/C14H26N3O9/c1-3-5(17-12(16)13(23)24)2-4(15)14(25-3)26-11-9(21)7(19)6(18)8(20)10(11)22/h3-11,14,17-23H,2,15-16H2,1H3
52 atoms
O  0.774744 -0.828418 -0.300953
O  -0.851982 -0.793152 1.341556
O  1.536401 0.651816 2.177172
O  2.842902 -2.037975 -1.583083
O  4.19442 -0.103212 2.265576
O  5.223645 -0.564581 -1.794876
O  5.965017 1.082452 0.428511
O  -6.358865 2.52528 -1.306851
O  -4.366396 2.706306 -2.328991
N  -1.924012 -3.200962 0.141882
N  -3.421332 0.693403 -0.835531
N  -5.492478 0.535545 0.202831
C  2.094061 -0.699817 0.208707
C  2.264752 0.616148 0.970942
C  3.021091 -0.771175 -0.996941
C  3.724386 0.861219 1.349117
C  4.472482 -0.5361 -0.601142
C  4.619131 0.803056 0.119274
C  -0.145158 -1.584457 0.412494
C  -1.089842 -2.256255 -0.581036
C  -1.972701 -1.204909 -1.240669
C  -2.682919 -0.373834 -0.177195
C  -1.672376 0.237503 0.803516
C  -2.323153 0.939699 1.974524
C  -4.656925 1.056491 -0.652713
C  -5.116746 2.205003 -1.543064
H  2.318889 -1.538388 0.882312
H  1.954385 1.432385 0.300314
H  2.731152 0.027392 -1.699248
H  3.795565 1.870156 1.780211
H  4.787935 -1.348587 0.070167
H  4.298237 1.597285 -0.563591
H  0.361737 -2.343131 1.022125
H  -0.464619 -2.725981 -1.35176
H  -2.706687 -1.687857 -1.890126
H  -1.365357 -0.554466 -1.876516
H  -3.377648 -1.012343 0.370474
H  -1.058013 0.960443 0.249622
H  0.66693 0.244131 2.059274
H  3.404488 -2.090134 -2.363845
H  3.670734 -0.037525 3.071545
H  6.159387 -0.558095 -1.568154
H  6.257341 0.464542 1.108848
H  -2.969411 0.265345 2.538924
H  -1.563366 1.332136 2.651793
H  -2.917609 1.789855 1.640854
H  -1.349407 -3.932602 0.543759
H  -2.545292 -3.664005 -0.510277
H  -6.442284 0.872315 0.270047
H  -5.232865 -0.209791 0.835346
H  -6.655747 3.263772 -1.866484
H  -2.910359 1.221991 -1.536872
elementType: O N C H
totalener: -1390.52493465 hartree
nucrepener: 2684.67454093 hartree
electener: -4075.19947558 hartree
oneelecener: -7219.51674735 hartree
twoeener: 3144.31727177 hartree
cpcmener: -0.14007928 hartree
kineticenergy: 1384.55731166 hartree
xcener: -127.509749553673 hartree
chargesum: 1.0000000
charge: -0.368672 -0.376267 -0.457962 -0.400708 -0.422131 -0.410205 -0.423298 -0.261168 -0.366775 -0.450103 -0.130975 -0.128160 0.104932 0.049841 0.098888 0.135631 0.039062 0.148473 0.227140 0.192179 -0.235534 0.153574 0.088029 -0.318395 0.263581 0.409387 0.078939 0.084028 0.091239 0.108595 0.088904 0.093025 0.131201 0.114867 0.102903 0.110231 0.095007 0.097680 0.245194 0.224826 0.220872 0.227970 0.226956 0.096357 0.106859 0.096640 0.139092 0.142025 0.216162 0.222081 0.281900 0.196080
qa: -0.3687 -0.3763 -0.4580 -0.4007 -0.4221 -0.4102 -0.4233 -0.2612 -0.3668 -0.4501 -0.1310 -0.1282 0.1049 0.0498 0.0989 0.1356 0.0391 0.1485 0.2271 0.1922 -0.2355 0.1536 0.0880 -0.3184 0.2636 0.4094 0.0789 0.0840 0.0912 0.1086 0.0889 0.0930 0.1312 0.1149 0.1029 0.1102 0.0950 0.0977 0.2452 0.2248 0.2209 0.2280 0.2270 0.0964 0.1069 0.0966 0.1391 0.1420 0.2162 0.2221 0.2819 0.1961
va: 2.0247 1.9967 1.9898 2.0276 2.0408 2.0091 2.0183 2.2657 2.1312 2.9559 3.4844 3.4492 3.8044 4.0670 3.9579 3.9350 3.9900 3.8778 4.0840 3.8256 4.0020 3.6805 3.8418 3.9655 4.0822 4.2337 1.0530 1.0160 1.0254 1.0029 1.0331 1.0235 0.9903 1.0265 1.0179 1.0309 1.0644 1.0065 1.0540 1.0173 1.0260 1.0148 1.0142 1.0058 1.0123 1.0064 1.0216 1.0181 0.9984 0.9871 0.9771 1.0188
dispersion: -0.029841221 hartree
energy: -1390.554775874717 hartree
dipole: -0.80277 -8.24045 -9.04321 -5.91925 6.57580 0.65655 5.16647 -5.77178 -0.60531
magnitude: 9.08720 au
magnitude: 23.09782 debye
