program: Orca
programVersion: 5.0.2
elementType: O O O O O O O O O N N C C C C C C C C C C C C C C C C C C C C C C H H H H H H H H H H H H H H H H H H H H H H H
charge: -1
multiplicity: 1
keywords: wb97x-d3
keywords: def2-TZVPP
keywords: def2/J RIJCOSX
keywords: DEFGRID2
keywords: scfconv7
keywords: smallprint printgap noloewdin
keywords: NOSOSCF
formula: C22H23N2O9
InChI: InChI=1/C22H23N2O9/c1-21(32)7-5-4-6-8(25)9(7)15(26)10-12(21)17(28)13-14(24(2)3)16(27)11(20(23)31)19(30)22(13,33)18(10)29/h4-6,12-14,17,25,28,30,32-33H,23H2,1-3H3
56 atoms
O  -0.699719 1.393274 2.643721
O  1.414754 2.694385 0.260491
O  -3.186932 2.092201 1.593161
O  1.221433 0.674292 -2.360976
O  3.568506 1.884016 -0.965176
O  -1.310828 -0.576849 -2.818625
O  3.141076 -2.340823 1.007592
O  -3.113127 -2.199466 -2.587242
O  5.509743 0.437215 -0.987058
N  0.589124 -1.799529 1.898891
N  5.45235 -1.612838 -0.073861
C  0.916348 0.526073 1.118817
C  -1.230248 1.561284 0.226534
C  -0.588984 0.771523 1.377115
C  1.45877 1.325139 -0.071027
C  1.195369 -0.974852 0.888606
C  -2.760036 1.680292 0.294697
C  -0.783823 0.937576 -1.07555
C  0.614709 0.974285 -1.343289
C  2.894248 0.9564 -0.370619
C  -3.420903 0.36595 -0.023368
C  2.67644 -1.262805 0.652623
C  -1.613925 0.032878 -1.759615
C  3.464823 -0.253404 -0.022346
C  -3.24506 2.723667 -0.719863
C  -2.897465 -0.351204 -1.100701
C  -4.553525 -0.077023 0.642111
C  0.201861 -3.127471 1.501391
C  1.110742 -1.715785 3.236555
C  -3.555846 -1.519305 -1.543682
C  4.870146 -0.455643 -0.391722
C  -5.169909 -1.251034 0.222798
C  -4.691707 -1.963957 -0.857972
H  1.459976 0.860857 2.009343
H  -0.859943 2.589955 0.28572
H  -1.077364 -0.210299 1.405741
H  0.703402 -1.237675 -0.058835
H  -2.967694 2.452048 -1.735819
H  -2.792847 3.699389 -0.511519
H  -4.330233 2.823412 -0.670888
H  -1.645449 1.465936 2.805656
H  1.688307 3.190909 -0.516994
H  -2.886761 2.999335 1.704859
H  -4.955004 0.481061 1.475129
H  -0.555522 -3.506707 2.193377
H  -0.258619 -3.097337 0.512796
H  1.02418 -3.852713 1.471097
H  0.379305 -2.139015 3.929804
H  2.05948 -2.24672 3.389972
H  1.24641 -0.674972 3.530131
H  4.504905 1.485521 -1.124362
H  -6.04853 -1.60841 0.747044
H  -5.180798 -2.870071 -1.192764
H  4.89921 -2.317079 0.399119
H  6.404566 -1.769452 -0.34931
H  -2.298324 -1.654886 -2.902233
totalener: -1638.99853036 hartree
nucrepener: 3819.69831126 hartree
electener: -5458.69684162 hartree
oneelecener: -9870.15406040 hartree
twoeener: 4411.45721878 hartree
kineticenergy: 1632.43712030 hartree
xcener: -152.452306980368 hartree
chargesum: -1.0000000
charge: -0.377340 -0.341957 -0.365139 -0.351874 -0.331179 -0.434203 -0.458443 -0.389308 -0.449143 -0.183069 -0.260502 0.263833 0.297925 -0.256310 0.443988 -0.083450 0.496309 -0.337580 -0.057460 0.150975 -0.106041 0.221570 0.083512 -0.203963 -0.310650 -0.067964 -0.247696 -0.177470 -0.197552 0.229346 0.322276 -0.075938 -0.218186 0.068147 0.056964 0.122351 0.129213 0.110653 0.064711 0.098848 0.178377 0.179065 0.161709 0.101038 0.077254 0.090512 0.085470 0.077687 0.082358 0.093316 0.235276 0.097009 0.089126 0.194338 0.138151 0.241111
qa: -0.3773 -0.3420 -0.3651 -0.3519 -0.3312 -0.4342 -0.4584 -0.3893 -0.4491 -0.1831 -0.2605 0.2638 0.2979 -0.2563 0.4440 -0.0834 0.4963 -0.3376 -0.0575 0.1510 -0.1060 0.2216 0.0835 -0.2040 -0.3106 -0.0680 -0.2477 -0.1775 -0.1976 0.2293 0.3223 -0.0759 -0.2182 0.0681 0.0570 0.1224 0.1292 0.1107 0.0647 0.0988 0.1784 0.1791 0.1617 0.1010 0.0773 0.0905 0.0855 0.0777 0.0824 0.0933 0.2353 0.0970 0.0891 0.1943 0.1382 0.2411
va: 2.0440 2.1044 2.0520 2.1665 2.2268 2.0933 2.0495 2.1273 2.0833 2.8692 3.2254 3.3079 3.2339 4.2238 3.7651 4.0442 3.6439 3.4448 4.5145 4.0420 3.7143 4.0050 4.2625 3.3751 3.9485 3.3518 4.0343 3.9406 3.9468 4.0334 4.2595 3.9147 4.0249 1.0518 1.0665 1.0248 0.9850 1.0049 1.0068 1.0103 1.0877 1.0545 1.0580 1.0406 0.9930 1.0036 1.0022 0.9958 1.0024 1.0096 1.1239 1.0020 1.0238 1.0628 1.0410 1.1085
dispersion: -0.038056475 hartree
energy: -1639.036586834635 hartree
dipole: -10.47186 10.86050 0.38864 -4.72003 5.27556 0.55553 16.38431 -14.11664 2.26767
magnitude: 2.36685 au
magnitude: 6.01606 debye
