program: Gaussian 09
title: 000007322
version: EM64L-G09RevD.01
frameworkgroup: C1[X(C7H6O6S)]
method: RPBEPBE
basis: SDD
operation: Freq
keyword: #pfreq=noraman
keyword: PBEPBE/SDD
title: #p freq=noraman PBEPBE/SDD
converged: YES YES NO NO
title: Mulliken charges:
elementType: S O O O O O O C C C C C C C H H H H H H
charge: 0.992384 -0.566859 -0.382437 -0.499491 -0.497556 -0.411724 -0.318777 -0.077051 -0.292324 0.129960 -0.188423 0.159544 -0.303661 0.190803 0.317262 0.289016 0.276752 0.384941 0.395227 0.402414
chargesum: 0.00000
title: Mulliken charges with hydrogens summed into heavy atoms:
elementType: S O O O O O O C C C C C C C
charge: 0.992384 -0.181918 0.012790 -0.499491 -0.497556 -0.009310 -0.318777 -0.077051 0.024937 0.129960 0.100594 0.159544 -0.026909 0.190803
polarizability: 1.77157808e+02 -2.47886522e+00 1.33200483e+02 9.13974329e-01 1.56743716e-01 6.66148263e+01
1716.lowfreq: -8.0425 -2.6191 -0.0015 -0.0011 -0.0010 3.7526 27.5403 71.3631 104.4671
frequency: 27.5271 71.3588 104.4599 113.1778 148.6830 174.0693 189.1537 207.2014 229.8381 284.0313 302.0881 334.7730 369.5220 378.7670 416.7532 427.2581 430.7176 514.7483 523.8209 559.0473 594.9819 617.4792 625.7760 695.1677 743.6572 769.0299 824.4027 841.3359 846.4232 866.4178 943.3719 968.5976 983.5799 1031.0090 1048.2181 1062.7845 1117.9838 1153.7591 1222.8885 1266.1455 1304.2646 1402.6145 1412.3715 1423.1560 1460.5621 1564.9614 1579.8005 1642.0959 3013.6970 3161.3296 3171.0635 3189.1589 3479.6752 3534.5047
redmass: 8.1911 8.5055 9.2093 7.5884 4.8706 2.7285 4.7960 3.3419 7.6523 3.2994 9.0463 8.8368 7.7470 8.3053 11.6670 3.2005 9.4395 4.7752 4.9130 3.9130 1.3806 6.4202 6.0866 5.5836 5.5719 3.5510 9.6766 1.5351 8.2688 1.1140 1.4487 15.7535 1.3656 4.3603 1.2265 2.0064 1.7228 1.4828 1.3504 3.1969 1.6904 3.4817 6.7469 2.9418 3.2044 4.0961 8.5893 5.1572 1.0685 1.0906 1.0932 1.0964 1.0661 1.0644
irintensity: 1.6051 0.8838 1.2676 0.5420 4.7751 25.6555 9.3372 22.3793 8.8250 50.7746 15.3101 29.6711 0.2028 13.9399 96.0602 12.1672 1.1172 17.7785 47.1914 55.2293 200.3819 46.8401 46.8688 4.7363 6.4237 0.0912 37.6134 132.7559 45.2729 77.4346 10.9573 77.5010 0.5890 201.4109 58.6828 82.3811 89.6576 112.6821 87.0729 115.5942 72.8714 110.0282 4.6798 136.1542 87.7041 3.5677 137.0787 240.2064 329.9802 3.1621 10.3761 1.3953 45.7775 87.7902
temp: 298.150 k
press: 1.00000 atm
elementType: 16 8 8 8 8 8 8 6 6 6 6 6 6 6 1 1 1 1 1 1
symmnumber: 1
zpe: 331181.7 jmol-1
zpe.correction: 0.126140 hartree
zpe.thermalcorrener: 0.139706 hartree
zpe.thermalcorrenthalpy: 0.140650 hartree
zpe.thermalcorrgfe: 0.085262 hartree
zpe.sumelectzpe: -1118.557288 hartree
zpe.sumelectthermal: -1118.543723 hartree
zpe.sumelectthermalent: -1118.542779 hartree
zpe.sumelectthermalfe: -1118.598167 hartree
dipole: 2.6415 -0.6608 1.4193
dipole: 3.0706
quadrupole: -93.3279 -82.3212 -91.3092
quadrupole: -9.0532 -9.0744 -2.1010
quadrupole: -4.3418 6.6649 -2.3231 -9.0532 -9.0744 -2.1010
hfenergy: -1118.6834289 hartree
pointgroup: C01 [X(C7H6O6S1)]
dipole: -1.0537219 -0.2614478 -0.529861 debye
dipolederiv: 2.1189164 -0.144872 -0.0987561 -0.3103503 1.220933 0.0211567 -0.2343723 0.047111 1.6575624 -0.5620092 -0.038064 0.2236715 0.0017494 -0.5334506 -0.0560441 0.3208817 -0.0633924 -1.0022107 -1.3571289 0.3607706 0.0194785 0.2061108 -0.4771053 -0.0032907 0.0095909 -0.0033097 -0.3809775 -0.7640702 -0.0322699 -0.0503455 -0.0390792 -0.542193 -0.1058528 -0.0016198 -0.0306843 -0.5143345 -0.667152 0.0548938 0.0209018 0.1401444 -0.6133606 0.1091732 0.0164927 0.0255948 -0.5035172 -0.2411119 0.1096308 0.0010924 -0.1873864 -1.3865149 -0.0053783 -0.0028473 -0.014121 -0.400338 -1.2373939 0.0010924 0.0127637 -0.0959665 -0.6857238 -0.0016135 0.0034269 -0.0045543 -0.3507047 -0.3333096 -0.145786 -0.0127921 -0.1233692 -0.4447352 0.0022329 -0.1598102 0.0251391 -0.1841816 0.4143015 0.2891781 0.0017423 0.2377767 -0.0304896 -0.003995 0.0071441 -0.0128345 -0.012631 -0.824056 -0.4053136 0.0084609 -0.1262422 -0.5454761 -0.0043299 0.0196127 -0.0027058 -0.0384407 0.0098933 -0.0614341 0.0017125 -0.2386909 0.2883158 0.0058604 0.0116563 0.0147638 -0.0475042 1.2865139 -0.4764364 -0.0190843 -0.0999876 0.3730905 0.0038486 -0.0079633 0.0053569 0.1294274 -0.5176673 0.1333536 0.0121419 -0.1480372 0.132715 0.0046295 0.0141652 -0.0029597 -0.1586161 1.5700479 0.2845714 -0.0133418 0.6011575 1.7925375 0.0041817 -0.0041684 0.0179836 0.2731339 0.1723557 0.0280082 -0.0077862 0.0157056 0.1048062 -0.0010023 -0.0039729 0.0073694 0.1537878 0.0970161 -0.0692463 -0.0062557 -0.0331062 0.1151394 0.0045701 -0.0073599 -0.0060962 0.151297 0.0542173 0.043341 0.0015989 0.0181947 0.0011382 -0.0037131 -0.0052366 -0.0021738 0.1764604 0.1186322 0.0752117 -0.0935562 0.0704605 0.3312153 0.0308859 0.0215061 -0.0021244 0.2696773 0.5136716 0.0254464 -0.0030613 0.061206 0.4767429 -0.0003131 0.0005269 0.0004609 0.3741881 0.1483332 -0.0320758 0.0014146 0.0497102 0.4224151 -0.0010062 0.0023472 0.0011766 0.407922 unknown
polarizability: 177.0311|3.0713618|133.2480763|-2.6437966|1.1862502|66.6939417 unknown
InChI: InChI=1S/C7H6O6S/c8-6-2-1-4(14(11,12)13)3-5(6)7(9)10/h1-3,8-9,11H
charge 0 multiplicity 1
20 atoms
S  2.79334 -0.233496 0.065327
O  2.988857 -0.248753 -1.783095
O  -2.894165 1.735634 0.102988
O  3.752592 0.920367 0.670829
O  2.881103 -1.755326 0.606948
O  -2.11238 -2.438858 0.051531
O  -3.681753 -0.734126 0.079167
C  1.025335 0.346963 0.061539
C  0.01561 -0.613929 0.053907
C  -1.329995 -0.166722 0.07222
C  0.780728 1.739709 0.080955
C  -1.614833 1.245887 0.088919
C  -0.547152 2.184843 0.098781
C  -2.46054 -1.103159 0.06836
H  0.240567 -1.684635 0.049307
H  1.616711 2.446036 0.098767
H  -0.792852 3.249363 0.116863
H  3.928042 -0.531217 -1.986715
H  -3.549091 0.951227 0.096854
H  -2.930522 -3.004809 0.051147
