program: Orca
programVersion: 5.0.2
elementType: O O O O O O O O O N N C C C C C C C C C C C C C C C C C C C C C C H H H H H H H H H H H H H H H H H H H H H H H
charge: -1
multiplicity: 1
keywords: wb97x-d3
keywords: def2-TZVPP
keywords: def2/J RIJCOSX
keywords: DEFGRID2
keywords: scfconv7
keywords: smallprint printgap noloewdin
keywords: NOSOSCF
formula: C22H23N2O9
InChI: InChI=1/C22H23N2O9/c1-21(32)7-5-4-6-8(25)9(7)15(26)10-12(21)17(28)13-14(24(2)3)16(27)11(20(23)31)19(30)22(13,33)18(10)29/h4-6,12-14,17,25,28,30,32-33H,23H2,1-3H3
56 atoms
O  -0.532944 -0.343367 2.773696
O  2.340417 2.022335 -0.302475
O  -1.169347 -2.058603 -0.812683
O  0.459329 2.172868 -1.947472
O  1.745179 -0.699202 -1.780464
O  -2.224414 1.900487 -2.497382
O  4.377074 -0.445478 2.072399
O  -4.620428 1.538751 -2.915934
O  3.499551 -2.359228 -1.545324
N  2.689136 1.448571 3.142356
N  4.894825 -2.376093 0.211933
C  0.981521 0.847579 1.316445
C  -1.329753 -0.017139 0.505151
C  -0.116659 -0.224283 1.427565
C  1.37958 1.01592 -0.137068
C  2.182404 0.456216 2.219872
C  -2.001788 -1.349807 0.090764
C  -1.067464 0.807518 -0.739673
C  0.176668 1.384098 -1.029095
C  2.053704 -0.258524 -0.604135
C  -3.31748 -0.990163 -0.609529
C  3.320339 -0.256128 1.487237
C  -2.180888 1.034812 -1.586587
C  3.049124 -0.813968 0.171749
C  -2.233791 -2.293345 1.261957
C  -3.368984 0.165731 -1.406712
C  -4.435858 -1.805589 -0.52556
C  3.276586 2.63413 2.562076
C  1.75098 1.780211 4.188158
C  -4.548907 0.4755 -2.117638
C  3.838286 -1.896329 -0.429845
C  -5.602583 -1.47379 -1.207886
C  -5.670748 -0.344633 -1.996278
H  0.569841 1.805906 1.657132
H  -2.075721 0.52382 1.105771
H  0.345012 -1.189502 1.191264
H  1.820114 -0.357081 2.862831
H  -2.894303 -1.854012 2.00829
H  -1.297456 -2.556553 1.750435
H  -2.679308 -3.230803 0.928907
H  -0.951698 0.485533 3.033529
H  2.06142 2.463458 -1.131629
H  -0.881454 -1.442549 -1.500007
H  -4.428017 -2.705362 0.071962
H  2.555977 3.31368 2.087379
H  3.77931 3.198367 3.350437
H  4.032898 2.37786 1.821494
H  0.865511 2.337789 3.845984
H  1.403765 0.87698 4.691731
H  2.24761 2.401593 4.935986
H  2.376113 -1.500071 -1.941633
H  -6.469615 -2.117347 -1.123963
H  -6.574988 -0.093846 -2.537236
H  5.20465 -1.949049 1.072111
H  5.441084 -3.111737 -0.208014
H  -3.680091 1.905749 -2.937048
elementType: O N C H
totalener: -1639.09351803 hartree
nucrepener: 3778.19640681 hartree
electener: -5417.28992484 hartree
oneelecener: -9787.46122785 hartree
twoeener: 4370.17130301 hartree
cpcmener: -0.11599894 hartree
kineticenergy: 1632.37044912 hartree
xcener: -152.456392230924 hartree
chargesum: -1.0000000
charge: -0.428401 -0.421266 -0.437962 -0.543318 -0.330629 -0.518738 -0.469500 -0.419165 -0.509052 -0.198825 -0.242932 0.117358 0.141144 -0.083698 0.595037 -0.044939 0.610272 -0.379366 0.153611 0.173813 -0.170436 0.258840 0.241829 -0.376029 -0.401481 -0.161497 -0.252703 -0.200557 -0.205883 0.246509 0.315786 -0.103910 -0.251433 0.097987 0.103396 0.117810 0.107056 0.109375 0.096177 0.100847 0.214096 0.223227 0.234751 0.143991 0.072741 0.103953 0.093560 0.077130 0.096951 0.102989 0.260684 0.151234 0.130983 0.215876 0.184329 0.258374
qa: -0.4284 -0.4213 -0.4380 -0.5433 -0.3306 -0.5187 -0.4695 -0.4192 -0.5091 -0.1988 -0.2429 0.1174 0.1411 -0.0837 0.5950 -0.0449 0.6103 -0.3794 0.1536 0.1738 -0.1704 0.2588 0.2418 -0.3760 -0.4015 -0.1615 -0.2527 -0.2006 -0.2059 0.2465 0.3158 -0.1039 -0.2514 0.0980 0.1034 0.1178 0.1071 0.1094 0.0962 0.1008 0.2141 0.2232 0.2348 0.1440 0.0727 0.1040 0.0936 0.0771 0.0970 0.1030 0.2607 0.1512 0.1310 0.2159 0.1843 0.2584
va: 1.9728 2.0285 1.9991 1.9622 2.2202 1.9830 2.0262 2.0824 2.0133 2.9029 3.2732 3.5650 3.6678 4.0021 3.7988 3.9021 3.5212 3.3266 4.0898 3.8944 3.7861 4.0054 4.1265 3.4479 3.9871 3.5163 3.9436 3.9421 3.9527 3.9673 4.2929 3.9368 4.0009 1.0092 1.0088 0.9942 1.0432 1.0051 1.0166 1.0111 1.0193 1.0641 1.0168 1.0040 1.0101 0.9961 1.0072 0.9943 1.0016 0.9968 1.0873 0.9916 1.0148 1.0271 1.0120 1.0765
dispersion: -0.037725215 hartree
energy: -1639.131243241489 hartree
dipole: 0.70618 -0.34822 0.35797 -0.40719 -1.57240 -1.97958 23.63712 -19.62945 4.00767
magnitude: 4.48423 au
magnitude: 11.39801 debye
