program: Orca
programVersion: 5.0.2
elementType: O O O O O O O O O N N C C C C C C C C C C C C C C C C C C C C C C H H H H H H H H H H H H H H H H H H H H H H H
charge: -1
multiplicity: 1
keywords: wb97x-d3
keywords: def2-TZVPP
keywords: def2/J RIJCOSX
keywords: DEFGRID2
keywords: scfconv7
keywords: smallprint printgap noloewdin
keywords: NOSOSCF
formula: C22H23N2O9
InChI: InChI=1/C22H23N2O9/c1-21(32)7-5-4-6-8(25)9(7)15(26)10-12(21)17(28)13-14(24(2)3)16(27)11(20(23)31)19(30)22(13,33)18(10)29/h4-6,12-14,17,23,25-26,28,30,32-33H,1-3H3
56 atoms
O  -0.024209 2.246481 2.375989
O  -1.071338 -0.403849 2.740478
O  1.751736 1.617068 -1.25626
O  -0.478471 -2.40023 0.409148
O  -3.259676 -1.662652 2.134321
O  1.827351 -2.579996 -0.366656
O  -2.992325 -0.238724 -2.289148
O  4.378567 -2.952608 -0.591357
O  -5.608079 -0.548105 -0.599002
N  -2.03669 2.284141 -1.20122
N  -4.925468 -2.708288 -0.356424
C  -1.339675 1.013561 0.75758
C  1.249809 0.85497 0.929734
C  -0.020907 1.731571 1.047543
C  -1.362323 -0.381465 1.359518
C  -1.648841 0.958111 -0.742271
C  2.317701 1.513593 0.039159
C  0.986548 -0.563657 0.492062
C  -0.264229 -1.211382 0.704309
C  -2.729614 -0.984644 1.123421
C  3.543632 0.604467 -0.071377
C  -2.696103 -0.100613 -1.112101
C  2.011146 -1.31721 -0.030083
C  -3.354724 -0.858666 -0.061958
C  2.684185 2.891344 0.582733
C  3.351154 -0.786829 -0.202478
C  4.817927 1.126458 -0.181677
C  -1.649106 2.614084 -2.553933
C  -3.41132 2.653491 -0.933835
C  4.456848 -1.625913 -0.453724
C  -4.733426 -1.423168 -0.359525
C  5.904387 0.28716 -0.418127
C  5.732797 -1.070696 -0.558055
H  -2.138515 1.588664 1.240783
H  1.684841 0.81335 1.936402
H  0.032401 2.560237 0.336671
H  -0.733828 0.68804 -1.279611
H  3.158471 2.824577 1.561882
H  1.804982 3.526268 0.679899
H  3.366478 3.417394 -0.086152
H  -0.69091 2.941454 2.42893
H  2.362505 2.099643 -1.825448
H  4.995503 2.187472 -0.090474
H  -1.723919 3.69491 -2.697128
H  -0.609696 2.33408 -2.725055
H  -2.260548 2.14024 -3.331727
H  -3.690375 2.425891 0.095978
H  -3.525746 3.731269 -1.065426
H  -4.145392 2.16568 -1.588987
H  -2.692911 -1.546176 2.914647
H  6.897715 0.709353 -0.500062
H  6.576017 -1.722344 -0.748904
H  -4.052743 -3.181891 -0.149396
H  3.450981 -3.242006 -0.549554
H  0.861769 -2.811282 -0.132096
H  -0.924073 0.499478 3.059676
elementType: O N C H
totalener: -1639.04041556 hartree
nucrepener: 3795.26928663 hartree
electener: -5434.30970218 hartree
oneelecener: -9817.88091410 hartree
twoeener: 4383.57121191 hartree
cpcmener: -0.17642696 hartree
kineticenergy: 1632.28729861 hartree
xcener: -152.416860859360 hartree
chargesum: -1.0000000
charge: -0.418292 -0.450530 -0.383254 -0.454684 -0.307548 -0.369681 -0.450870 -0.358566 -0.658473 -0.244588 -0.501256 0.109287 0.172712 -0.072468 0.602942 -0.042643 0.520335 -0.402913 0.170525 0.164982 -0.181013 0.195426 0.254042 -0.185484 -0.381652 -0.090683 -0.168658 -0.193981 -0.217903 0.241150 0.087175 -0.112928 -0.215160 0.113348 0.090819 0.097490 0.126295 0.115531 0.113750 0.104415 0.223064 0.209865 0.147150 0.098837 0.089252 0.085944 0.103387 0.104691 0.085288 0.245694 0.155460 0.138023 0.149239 0.251283 0.253635 0.242190
qa: -0.4183 -0.4505 -0.3833 -0.4547 -0.3075 -0.3697 -0.4509 -0.3586 -0.6585 -0.2446 -0.5013 0.1093 0.1727 -0.0725 0.6029 -0.0426 0.5203 -0.4029 0.1705 0.1650 -0.1810 0.1954 0.2540 -0.1855 -0.3817 -0.0907 -0.1687 -0.1940 -0.2179 0.2412 0.0872 -0.1129 -0.2152 0.1133 0.0908 0.0975 0.1263 0.1155 0.1137 0.1044 0.2231 0.2099 0.1472 0.0988 0.0893 0.0859 0.1034 0.1047 0.0853 0.2457 0.1555 0.1380 0.1492 0.2513 0.2536 0.2422
va: 1.9986 2.0078 2.0489 2.0736 2.2019 2.1574 2.0544 2.1524 1.8042 2.8928 2.8548 3.9207 3.5047 4.0772 3.5699 3.7987 3.7968 3.5598 4.0082 4.0240 3.8828 4.1559 3.9503 3.3057 3.9833 3.5821 3.8797 3.9328 3.9528 3.9520 4.7101 3.9656 3.9583 1.0289 1.0366 1.0572 1.0145 1.0008 1.0021 1.0018 1.0101 1.0180 1.0025 0.9910 1.0085 1.0080 0.9980 0.9953 1.0116 1.0202 0.9907 1.0116 1.0024 1.0415 1.0893 1.0410
dispersion: -0.038989573 hartree
energy: -1639.079405127923 hartree
dipole: 7.89797 4.47617 12.37413 26.84409 -20.85333 5.99076 -2.74839 5.75699 3.00860
magnitude: 14.07338 au
magnitude: 35.77169 debye
